Questions tagged [make]

Make is a utility that automatically builds executable programs and libraries from source code by reading files called makefiles which specify how to derive the target program.

Filter by
Sorted by
Tagged with
0
votes
0answers
17 views

Need help compiling Crafty chess engine from source

I'm trying to compile an older version of Crafty chess engine (version 23.2) on Ubuntu 16.04. I've never tried to compile stuff before but I did Google about it and have tried various commands but ...
0
votes
0answers
9 views

Error during installation process of Quantum Expresso in Ubuntu,

I have been trying to install Quantum Expresso in Ubuntu, but the following error message pops up after the command "make pw" unknown@unknownpc:~/Desktop/Quantum Expresso/qe-6.5$ make pw test -d bin |...
0
votes
0answers
28 views

How do I install essential packages in 20.04 LTS without a network connection

I have clean installed 20.04 on a machine I was previously running 16.04 on but i don't get any network (desktop with ethernet cable). When I try to install a driver for the ethernet card it wants ...
0
votes
1answer
45 views

Problems with Vim after upgrade Ubuntu to 20.04

I recently upgraded Ubuntu from 19.10 to 20.04 using do-release-upgrade, facing no problems whatsoever. I had Vim installed in my system (build from source). But now, when I try to run Vim, I get this ...
3
votes
1answer
67 views

“make” command does not work in directories containing “space”

I often use make to compile programs. But, sometimes, when the directory contains a space, it says: No such file or directory Example: If I run make in the directory /home/akib/My Directory/: If ...
1
vote
0answers
12 views

driver builds on one machine but not other: code model kernel does not support PIC mode

I have a driver for custom hardware, which I rebuild every time the kernel version updates. I have two different Ubuntu 18.04 machines, both of which are running the same version of gcc (gcc (Ubuntu 7....
1
vote
1answer
24 views

building remmina teamviewer plugin ubuntu 20.04

I am trying to build the remmina teamviewer plugin in my fresh ubuntu 20.04 install after getting an unspecified unmet dependency trying to install the remmina-plugin-teamviewer_1.0.0.2-1_amd64.deb ...
-1
votes
0answers
35 views

How to build from kernel source via make

I have changed some option in make menuconfig invoked with makefile in linux-headers-5.0.0-38 dir. Now I have the changed file in that dir named .config. I have read here: https://stackoverflow.com/...
0
votes
0answers
63 views

Having issue with a simple make, what should I do?

I'm trying to install a driver for a wi-fi key. So I go into the directory and type "sudo make", but I'm getting this : kubuntu@kubuntu:~/Desktop/DPO$ sudo make make -C tools make[1]: Entering ...
1
vote
0answers
73 views

Compile Error - Realtek High Definition Audio Codecs

I'm having a Ubuntu(20.04) installed ASUS laptop which having external headset not recognizing problem (i.e. even if I plugged a mic supported headset it uses laptop's in-build microphone). So I ...
0
votes
0answers
33 views

Compilation problem with make

While trying to build, I get a lot of warnings. I do the following in Colab: !git clone -qqq https://github.com/nu774/mp4fpsmod.git > /dev/null !sudo apt-get update -y -qqq --fix-missing &&...
0
votes
1answer
41 views

shell unnanme -r command not found [closed]

shantanu@LAPTOP-3NM82R8U:~/c$ make make: unname-r: Command not found make -C/lib/modules//build M=/home/shantanu/cmodules make[1]: *** /lib/modules//build: No such file or directory. Stop. Makefile:3:...
0
votes
0answers
16 views

Cache::Cache module problem

In Ubuntu for Windows: I've been getting the error: Can't locate Cache/Cache.pm in @INC (you may need to install the Cache::Cache module) when trying to run a GitHub script. When I do a fresh ...
0
votes
1answer
27 views

Make file wrong for building libbot2 library

Let me describe my problems. So far I was building the MPNet which requests the libbot2 library. MPNet GitHub libbot2 GitHub I have installed the requirement libraries as followed: GLib 2....
0
votes
0answers
168 views

Kernel module compilation error

I am getting an error, whenever I am trying to compile the module, as below: sudo make make -C /lib/modules/5.3.0-45-generic/build -I m=/home/shakti/Drivers/hello_param modules make[1]: Entering ...
0
votes
0answers
15 views

Why does Make hangs when I activate output-sync?

Given this simple Makefile test: @echo 'Hello World!' (this is not the actual Makefile that I want to use, but I reduced it to the strict minimum) When I run make test it prints the expected ...
0
votes
0answers
44 views

Cairo can not find OpenGL ES 2.0 headers on Ubuntu 18.04

I am trying to compile Cairo 1.16.0, but it fails, giving me the following errors: checking for cairo's OpenGLESv2 surface backend feature... checking for glesv2... no checking GLES2/gl2.h ...
0
votes
0answers
94 views

How to include <linux/timer.h> head file in Ubuntu?

I'm using Ubuntu 18.04 with kernel-4.15. When I include the header file <linux/timer.h> in the source code, the header file cannot be found:fatal error: linux/timer.h: No such file or directory. ...
0
votes
0answers
59 views

cannot execute binary file: Exec format error - Ubuntu 16.04 + Make + GCC

I am aware that other people had similar issues but mine seem to be unique as I am not making obvious mistakes. I have reviewed other questions and putting all required details below. When I am ...
0
votes
0answers
70 views

Grey Array: cannot connect to X server '(null)' Error

So I have this school folder, where I have to call the file "Test.c" file, where it contains the code to display an image. Calling the file requires me to type "make", which im assuming is from this ...
0
votes
1answer
48 views

./configure command completed with warning, configure: WARNING: `missing' script is too old or missing

After running command of ./configure sams@sams-desktop:~/Desktop/softwedge-1.0.0$ ./configure checking for a BSD-compatible install... /usr/bin/install -c checking whether build environment is sane......
0
votes
0answers
59 views

Why won't Ubuntu let me install fftw-2.1.5 — I get the error “214: recipe for target 'install-recursive' failed”

When I try and run the make install command in ubuntu's terminal, I get the below error. I cannot install any later versions because I am running an old code called GADGET2. Making install in ...
3
votes
1answer
286 views

How to install gitslave on Ubuntu 16.04.6 LTS?

I'm trying to install gitslave (as part of a CircleCI build) on Ubuntu 16.04.6 LTS and it fails at make: +tar -xzvf gitslave-2.0.2.tar.gz gitslave-2.0.2/ gitslave-2.0.2/web/ gitslave-2.0.2/web/index....
0
votes
0answers
107 views

make command can't find gcc

I've searched pretty extensively for a solution, however all the ones I've found relate to not having gcc in the PATH variable, or not properly installed. My issue is that when I run my Makefile, I ...
0
votes
0answers
39 views

How to stop “make” from running “clean”?

Have a Makefile like this: all: build build: dot2tex -ftikz temporal_dag.dot --figonly > temporal_dag.tex latex notes && bibtex notes && latex notes && ...
1
vote
1answer
377 views

make: *** No rule to make target 'ell/util.c' needed by 'ell/util.lo'

I need to install ofono, so I cloned this ofono repository and did autoreconf -fi and ./configure in the directory. But when I am running make or sudo make install I am encountering the following ...
0
votes
0answers
397 views

How to unistall python 3.8.1 from source code?

I ready installed python 3.8.1 from source code and now I want to remove them but I can´t remove them. I used the make uninstall command and throw this error "make: *** No rule to make target '...
0
votes
1answer
631 views

When installing libmtp: “collect2: error: ld returned 1 exit status”. How to debug/fix?

Following these instructions for fixing libmtp problems ... https://askubuntu.com/a/886986/296836 ... I get these errors ... ../src/.libs/libmtp.so: undefined reference to `usb_claim_interface' ../...
0
votes
1answer
86 views

Error when building tesseract from source [duplicate]

I've hit an error trying to build tesseract. From the log output, my suspicion is that there is some python2 code causing an issue. My system python is 3.7. Not sure how to resolve, any tips ...
-2
votes
2answers
102 views

How to install ASF MapReady software in Ubuntu? [closed]

I am trying to install a software named ASF MapReady from github. But unable to proceed while running the first step ./configure --prefix=/usr/local as in the description of github. The error I get: ...
0
votes
0answers
79 views

make error when installing thrift 0.5.0

I get error whenever I'm trying to 'make' file, I did this before I typed 'make': 1)tar zxf thrift-XXX.tar.gz 2)cd thrift-XXX 3)./configure The output of ./configure is: ./configure checking for a ...
0
votes
0answers
109 views

Upon using “gem install ncode-syosetu”, i get “ERROR: Failed to build gem native extension.” and “make install failed, exit code 2”

I'm trying to install the NcodeSyosetu module using: gem install ncode-syosetu but the output i get is: Building native extensions. This could take a while... Successfully installed concurrent-ruby-...
0
votes
0answers
108 views

TL-WN722N V3 Drivers Ubuntu 16.04

I bought TL-WN722N V3 USB Adapter and I followed the installation guide PDF for Ubuntu 16.04 on its page. Nevertheless, after using the command make, I have the following errors: > make ARCH=...
0
votes
2answers
141 views

How do I install 'Make' without internet connection?

I need to install wifi drivers on my laptop, the drivers I have use 'Make' during the install process. How can I download 'Make' without installing and save to usb (obviously using a pc with ...
0
votes
1answer
929 views

rtl8822bu fails after Ubuntu 19.10 update

Started with Ubuntu few months ago. My HW is in older machines too slow to handle Windows, so Ubuntu 19.04 was right solution. I'm not so familiar with Ubuntu, but I see necessity of compiling drivers ...
0
votes
0answers
43 views

Why do i get a error from make while trying to install a tar.gz file

im trying to install winehq from online and gave me a tar.gz file so i ran tar xvfc and got the wine folder.I read the README.txt file and it told me to type ./configure and i got o errors then i ...
0
votes
0answers
32 views

Unable to compile simulink s function for comedi interfacing on linux lubuntu 64 bit

I have created simulink s-function block for comedi interfacing on windows 32 bit and compliled suceesfully. But I am unable to compile on 64 bit linux-rtai(lubuntu) system. I am getting following ...
1
vote
1answer
523 views

/usr/src/linux-headers-5.0.0-32-generic' arch/x86/Makefile:147: CONFIG_X86_X32 enabled but no binutils support

please help, i make a file named hello.c #include linux/module.h #include linux/kernel.h #include linux/init.h static int __init hello_start(void){ printk(KERN_INFO "Loading hello module...\n"); ...
0
votes
0answers
34 views

bash: /usr/local/bin/noip2: No such file or directory [duplicate]

gcc -Wall -g -Dlinux -DPREFIX=\"/usr/local\" noip2.c -o noip2 noip2.c:136:19: fatal error: stdio.h: No such file or directory #include <stdio.h> ^ compilation terminated. ...
1
vote
0answers
17 views

How to make a startup command uTorrent server [duplicate]

My issue that after reboot, I must enter this command using SSH PuTTY. utserver -settingspath /opt/utorrent-server-alpha-v3_3/ -daemon After this command I can access the uTorrent IP page. How ...
1
vote
0answers
53 views

compilation on different system gives 20x larger binary. Why?

Switched development to a new system. Went to GitHub and picked up the project but got one about 2 months newer then the one on my older system. Although only minor changes in the new GitHub ...
0
votes
1answer
198 views

Makefile error#2 when installing freeradius 2.2.8 eap libeap rlm_eap all modules all src all

I'm trying to install freeradius 2.2.8 on Ubuntu 18.04 and when creating the "make" file, i got the following errors: Do someone know what should i do or install? Making all in rlm_eap... /usr/bin/...
0
votes
0answers
357 views

cannot find -lstdc++

I'm trying to use make but I keep getting this error. Tried make clean, updating cpp and some other stuff. cc1plus: warning: command line option ‘-Wstrict-prototypes’ is valid for C/ObjC but not for ...
2
votes
1answer
352 views

how to solve this error? (collect2: fatal error: cannot find 'ld')

I'm a beginner and I need your help. I use Ubuntu18.04 and want to install Orient package for molecular calculation. https://gitlab.com/anthonyjs/orient I get this error when compiling it with ...
0
votes
0answers
24 views

Erros installing Opencv on Ubuntu16.04

I am following the tutorial Install OpenCV-Python in Ubuntu to install Opencv on Ubuntu 16.04. Every step is gone well until the last step. When I use make command in the last step, it appeared error ...
-1
votes
1answer
46 views

Make command doesn't execute but Makefile.am existed

I have been using Ubuntu (16.04) for only a week at most and I am still learning (with lots of confusion) on using the terminal. So right now I am following a tutorial for TensorFlow YOLO tutorial on ...
1
vote
0answers
36 views

How to make 'Make' to handle more new pairs of source files indicated by its extension name

How can we modify a Makefile script to handle more new pairs of source files indicated by its extension name to be compiled by Make automatically correctly and preferably interactively #... objects = ...
0
votes
0answers
32 views

need help installing sick lms200 sensor software

I have the LIDAR Sick lms200 http://sicktoolbox.sourceforge.net/ I would like to install the driver, but compiling the source ends in error. I have tried modifying the compilation flags to be c++11 ...
1
vote
0answers
34 views

Parallel builds using all cores hang entire computer

I have an Intel i9-9900K, a CPU with 8 physical cores and 16 threads, and I'm running Ubuntu 16.04. When I compile a project that is able to fully use all 16 threads (i.e. 16 long-running parallel ...
0
votes
0answers
202 views

Makefile.config:9: *** missing separator

I am trying this installation guide to setup caffe into raspberry pi 3. But after the 'makefile' change step, i am getting the following error: 'Makefile.config:9: *** missing separator. Stop.' ...

1
2 3 4 5
13