1

I have an Archer T4U wifi adapter but I can't install the drivers. Could someone please help me?

lsusb gives out this result

Bus 006 Device 003: ID 2357:0115 TP-Link 

When i try to compile it with make the following error shows up:

make ARCH=x86_64 CROSS_COMPILE= -C /lib/modules/5.0.0-27-generic/build M=/home/alvaro/rtl8822bu modules make[1]: se entra en el directorio '/usr/src/linux-headers-5.0.0-27-generic' CC [M] /home/alvaro/rtl8822bu/core/rtw_cmd.o In file included from /home/alvaro/rtl8822bu/include/osdep_service.h:41, from /home/alvaro/rtl8822bu/include/drv_types.h:32, from /home/alvaro/rtl8822bu/core/rtw_cmd.c:22: /home/alvaro/rtl8822bu/include/osdep_service_linux.h: In function ‘_init_timer’: /home/alvaro/rtl8822bu/include/osdep_service_linux.h:257:8: error: ‘_timer’ {aka ‘struct timer_list’} has no member named ‘data’ ptimer->data = (unsigned long)cntx; ^~ /home/alvaro/rtl8822bu/include/osdep_service_linux.h:258:2: error: implicit declaration of function ‘init_timer’; did you mean ‘_init_timer’? [-Werror=implicit-function-declaration] init_timer(ptimer); ^~~~~~~~~~ _init_timer In file included from /home/alvaro/rtl8822bu/include/drv_types.h:35, from /home/alvaro/rtl8822bu/core/rtw_cmd.c:22: /home/alvaro/rtl8822bu/include/wifi.h: At top level: /home/alvaro/rtl8822bu/include/wifi.h:1005: warning: "IEEE80211_MAX_AMPDU_BUF" redefined #define IEEE80211_MAX_AMPDU_BUF 0x40

In file included from /home/alvaro/rtl8822bu/include/osdep_service_linux.h:84, from /home/alvaro/rtl8822bu/include/osdep_service.h:41, from /home/alvaro/rtl8822bu/include/drv_types.h:32, from /home/alvaro/rtl8822bu/core/rtw_cmd.c:22: ./include/linux/ieee80211.h:1444: note: this is the location of the previous definition #define IEEE80211_MAX_AMPDU_BUF 0x100

cc1: some warnings being treated as errors make[2]: * [scripts/Makefile.build:286: /home/alvaro/rtl8822bu/core/rtw_cmd.o] Error 1 make[1]: * [Makefile:1606: module/home/alvaro/rtl8822bu] Error 2 make[1]: se sale del directorio '/usr/src/linux-headers-5.0.0-27-generic' make: *** [Makefile:1318: modules] Error 2

  • 2
    Please insert the device and run the terminal command: lsusb Next, edit your question to show the result. Welcome to Ask Ubuntu. – chili555 Aug 7 at 13:17
  • @alvaromz i know this thread is 2 months old but if you're still having the issue with your RTL8822BU adapter, you could try installing drivers as I have described in here: askubuntu.com/a/1179178/928088 I too have the same adapter and I just installed in Ubuntu MATE 19.04 running kernel 5.3.4, and the adapter is working just fine. – Jags Oct 6 at 23:40
0

As far as I know this USB Wifi Card is based on Realtek RLT8822BU Chipset.

On support page I only see "outdated" drivers T4U V3 180511 and T4U V3 181018 Beta, may they work, may not.

I would try to use driver from https://github.com/brandon-bailey/rtl8822bu and compile it.

sudo apt-get update
sudo apt-get install git
git clone https://github.com/brandon-bailey/rtl8822bu.git
cd rtl8822bu
make
sudo make install
sudo modprobe 8822bu
  • HI thanks for your answer but when i compile it with make the following error shows up – AlvaroMZ Sep 13 at 11:58

Your Answer

By clicking “Post Your Answer”, you agree to our terms of service, privacy policy and cookie policy

Not the answer you're looking for? Browse other questions tagged or ask your own question.