Questions relating to makefiles, (The file that contains the instructions for make)

learn more… | top users | synonyms

0
votes
2answers
423 views

Space escape character in Debian Makefiles

I'm currently trying to upload a package onto Launchpad's PPA service but I'm having problems with a path name which includes a space character. I'm trying to make a file install into a directory with ...
1
vote
1answer
3k views

Install rt3572 driver for Asus Usb-N53 Adapter

I recently bought the asus USB-N53 wireless adapter, and want to install the latest driver for it. It comes with instructions of how to install the driver from the files provided, but I can't use ...
1
vote
1answer
3k views

build a project with qmake-qt4

I'm new user of Ubuntu, so excuse me if my question is very obvious. I have a 32-bit Ubuntu 11.10 installed in VirtualBox, and I want to build a project using qmake-qt4, the problem is that I don't ...
1
vote
1answer
272 views

How to install bnetd in Lubuntu from command line?

I am trying to install bnetd on lubuntu and i got error compiling it (I have never compiled anything yet) I execute this at the terminal: loading cache ./config.cache checking host system type... ...
0
votes
1answer
47 views

How to use upstart tasks to create a new file with today's date?

I am trying to use Upstart to create a new file with today's date. I have created a file called "Open.conf" at /home/myusername/.config/upstart I have the following lines in that file: description "...
0
votes
1answer
192 views

Not able to install VLC program from .tar.xz file

I successfully uncompressed the .tar.xz file and then I also ran the ./configure command and I think it also worked. But the problem comes when I try to execute make command. The given INSTALL file ...
0
votes
1answer
40 views

Trouble linking libraries in FFTW

This error happens when I try to execute a Makefile: /usr/bin/ld: cannot find -lrfftw_mpi /usr/bin/ld: cannot find -lfftw_mpi /usr/bin/ld: cannot find -lrfftw collect2: error: ld returned 1 exit ...
0
votes
1answer
390 views

“Command not found” error in the installation process

Why I receive the following error while trying to install this package? and how can I resolve it? root@me-System-Product-Name:/home/me/Desktop/mfcuk-master# ls AUTHORS configure.ac INSTALL ...
0
votes
1answer
69 views

Multiple files in program tar.gz installation package. What should I compile?

I downloaded a tar.gz file, extracted it and there are 3 files: Makefile, program.c and protocol.h I've opened them in gedit and Makefile contains only one line program : program.c protocol.h In ...
0
votes
1answer
48 views

Writing a makefile

I want to write a makefile that has a build rule, a run rule and a clean (delete the exe file) rule . This is quite a simple task, but how can one incorporate some rule in the makefile such that the ...
0
votes
1answer
1k views

Error running make - array type has incomplete element type

I am trying to install libbow library. When i run make file the following error is generated gcc -c -Ibow -I. -I./argp -DHAVE_LIBNSL=1 -DHAVE_STRERROR=1 -DHAVE_GETTIMEOFDAY=1 -DHAVE_RANDOM=1 -...
0
votes
1answer
134 views

LD_LIBRARY_PATH

I have tried to link VINCIA to ROOT, but there is a problem related to the location of the shared libraries in my system. Since I have installed all these tools in a directory which is different than /...
0
votes
1answer
639 views

Undefined reference to symbol 'FcPatternAddDouble' - issue with building program

I'm Ubuntu 13.04 user. I haven't been able to build/install Japanese third-party software for artists called AzDrawing. Based on readme file, I executed make command in proper directory. At first it ...
0
votes
1answer
902 views

Installing wifi driver error 127

I've got problem with installation wifi driver, terminal says error 127. make[1]: Leaving directory `/usr/src/linux-headers-3.0.0-32-generic' root@jakub-HP-ProBook-4540s:/home/jakub/compat-wireless-3....
0
votes
1answer
436 views

Problems compiling Library

I am having some difficulties compiling some files that I downloaded (for academic purposes). I ran the following command : cd tmp/Detri_2.6.a/detri then make detri_new CC=gcc To build a ...
0
votes
1answer
458 views

x11 directory specified in makefile doesn't exist, but project compiles and runs perfectly

So the x11 directory defined in the makefile is: usr/X11R6/lib64, which does not exist. however, the project compiles perfectly in Kdevelop and runs with no problems. If I take out all inclusions of ...
2
votes
0answers
2k views

Make compiling error 'No rule to make target' when trying to install a driver

When I try to install a driver via sudo make I get these errors: make -C /lib/modules/3.8.0-31-generic/build M= make[1]: Entering directory `/usr/src/linux-headers-3.8.0-31-generic' make[2]: *** No ...
2
votes
0answers
77 views

Makefile question: how to make several analogous rules into one

I'm wondering if there's a way to make one rule out of the following several rules which are all similar in a Makefile that I have to edit: $(OBJECT_BUILD_DIR)/%.o : $(OBJECT_SRC_DIR)/%.cpp $(...
1
vote
0answers
33 views

Gromacs installation error: “make: No targets specified and no makefile found”

I am trying to install Gromacs 5.1.2 on Ubuntu 14.04. When I try to run make, it shows this warning, make: *** No targets specified and no makefile found. Stop. I am just a newbie, I looked up for ...
1
vote
0answers
20 views

How to install perf in make/build kernel process from source?

I am building an customized ubuntu from source files that include the tools/perf. What should I change in makefile or build process to install perf tool automatically in the building customized ubuntu ...
1
vote
0answers
18 views

Modify Ubuntu toolchain

In version 11.10 the flag "--as-needed" became default in the Ubuntu toolchain. Due to many problems I have with undefined symbols at runtime I don't want to change all the makefiles anymore. I want ...
0
votes
0answers
12 views

unable to run makefile (Like char drivers, UART drivers)

Unfortunately i run the below command.After this command i am not able to run any make file.I am also installed same OS but there is no use rm -rf make -C /lib/modules/$(shell uname -r)/build M=$(...
0
votes
0answers
39 views

Error while installing 'STAR' software with make

I am trying to install a software named "STAR" v.2.5.2a Installation should follow as under Linux: Get latest STAR source from releases wget https://github.com/alexdobin/STAR/archive/STAR_2.4.2a....
0
votes
0answers
20 views

error when running make for snort

make[4]: *** [spp_anomalydetection.o] Error 1 make[4]: Leaving directory `/home/bisag/snort_src/snort-2.9.8.0/src/preprocessors' make[3]: *** [all-recursive] Error 1 make[3]: Leaving directory `/home/...
0
votes
0answers
130 views

htk in ubuntu “make all” error “Nothing to be done for `all'.”

Hello folks actually i am trying to install htk on Ubuntu 14.04.3 . I did same as per this tutorial and I also followed this but I am still facing an error when I try to give the "make all" command. ...
0
votes
0answers
128 views

tput not working at all under ubuntu

I'm using my usual makefile pseduo function to control the terminal output. define colorecho @tput setaf 6 @echo $1 @tput sgr0 endef Which works fine on my OS X machine and my ...
0
votes
0answers
24 views

Error: “No tagets specified…”

The complete message says: "No tagets specified and no makefile found". I am trying to install the QuietInsane Gimp plugin for my scanner. Following the instructions I started with navigating to ...