Make is a utility that automatically builds executable programs and libraries from source code by reading files called makefiles which specify how to derive the target program.

learn more… | top users | synonyms

4
votes
0answers
206 views

Cannot find classmap.h

When i execute: make modules i get the error: make[1]: Nothing to be done for `all'. make[1]: Nothing to be done for `relocs'. CHK include/generated/uapi/linux/version.h CHK ...
2
votes
0answers
77 views

I get an error when I try to compile DAR on 12.04, how can I fix solve this?

Install DAR 2.4.12 from source because latest version ubuntu package is 2.4.2. ./configure --prefix=/usr dar and libdar have been successfully configured with the following parameters: LIBDAR ...
2
votes
0answers
650 views

Undefined reference to `memcpy@GLIBC_2.14' : Building Android SDK with SmartCard API support:

I am trying to build Android emulator with SmartCard API support. I was following this manuals: one two All steps passed ok, but when I run: PCSC_INCPATH=<path_to_pcsc-lite_32bit>/src/PCSC/ ...
2
votes
0answers
63 views

Makefile question: how to make several analogous rules into one

I'm wondering if there's a way to make one rule out of the following several rules which are all similar in a Makefile that I have to edit: $(OBJECT_BUILD_DIR)/%.o : $(OBJECT_SRC_DIR)/%.cpp ...
2
votes
0answers
539 views

make fails because it doesn't know “headers_install”

I'm trying to setup buildroot for cross-compiling a custom app. / # uname -a Linux Venus 2.6.12.6-VENUS #323634 Wed May 25 13:40:36 CST 2011 mips unknown So far I chose kernel version 2.6.12.6 in ...
1
vote
0answers
93 views

qmake could not exec error while building Qt from source

I'm having an issue building QT from it's sources. I have to build from sources due to a strange requirement (that's how we are going to do it at work, once we start using QT). Building from sources I ...
1
vote
0answers
138 views

How to install GNU Make 4.0 on Ubuntu 12.04

I need GNU Make 4.0+ because of the new file function. How can I install this on Ubuntu 12.04? I tried the .deb, but it depends on libc6 2.17.
1
vote
0answers
1k views

error adding symbols: DSO missing from command line

I am newbie to Ubuntu.i want to compile a project that uses opencv but it gives following error: cmake . && make /usr/bin/ld: ...
1
vote
0answers
48 views

I don't seem to have iwlconfig on my kernel

I recently compiled a Linux 3.0 Kernel from the latest stable Ubuntu release (Kernel 3.2.0 I believe) following all the steps you can see in this page: ...
1
vote
0answers
39 views

Uninstalling a compiled package

I have installed gambas2_2.23.1.orig.tar.gz from https://launchpad.net/ubuntu/+source/gambas2/2.23.1-1ubuntu3 in Ubuntu 13.10, by configuring and then making it. How can I uninstall it and reverse ...
1
vote
0answers
486 views

HOSTCC scripts/basic/fixdep gcc: error trying to exec 'cc1': execvp: No such file or directory

hardik@ubuntu:~/ti-sdk-beagleboard-05.07.00.00/board-support/linux-3.3.7$ make ARCH=arm CROSS_COMPILE=arm-none-linux-gnueabi- uImage HOSTCC scripts/basic/fixdep gcc: error trying to exec 'cc1': ...
1
vote
0answers
327 views

ZC0301 webcam Driver problem with Ubuntu distributions after 11.10

I'm having problem with Webcam and fed up with this search in Google for answers. So I've connected webcam to my computer having Ubuntu 13.10, and i tried to run luvcview program to simply see the ...
1
vote
0answers
2k views

Make compiling error 'No rule to make target' when trying to install a driver

When I try to install a driver via sudo make I get these errors: make -C /lib/modules/3.8.0-31-generic/build M= make[1]: Entering directory `/usr/src/linux-headers-3.8.0-31-generic' make[2]: *** No ...
0
votes
0answers
41 views

Cannot install last version of OpenCV on Ubuntu 14.10

I try to install opencv using the instructions from here but I get every time the error Linking CXX shared library ../../lib/libopencv_videoio.so /usr/bin/ld: /usr/local/lib/libavcodec.a(avpacket.o): ...
0
votes
0answers
17 views

strange process of making a slow network

whether this process, making the connection to be slow. how to eliminate it permanently, I have used comment kill -s 9 [PID]. but reappears help me please. tks PID USER PR NI VIRT RES SHR ...
0
votes
0answers
31 views

No targets specified and no makefile found

What dependency am I missing? I am stuck on this one since hours. Any help is very appreciated. ./configure output http://pastebin.com/yEZ7snWp
0
votes
0answers
20 views

Any body works on FBReader open source?

cannot install open source. it gets stuck after make install command. error in this line: @install -m 0644 $(wildcard data/icons/toolbar/$(VARIANT)/*.*) $(DESTDIR)$(APPIMAGEDIR_REAL) error ...
0
votes
0answers
128 views

Install error : install: missing destination file operand after `/usr/share/pixmaps/FBReader`

while i make install FBReader it gives error. install: missing destination file operand after `/usr/share/pixmaps/FBReader' basically it is missing DESTDIR i.e. destination directory coz echo ...
0
votes
0answers
51 views

Make Install error FBReader - execvp Permission denied make[1]: [do_install] Error 127

Make install error . While i make install in the root mode it says this. make[1]: execvp: ./scripts/install_help.sh: Permission denied make[1]: *** [do_install] Error 127 i changed the path of ...
0
votes
0answers
27 views

problem in installing virtuoso (make)

I want install 'virtuoso'. there is instruction like this: # For Ubuntu, make sure these dependencies are installed sudo apt-get install -y automake gawk gperf libtool bison flex libssl-dev ...
0
votes
0answers
143 views

undefined reference to symbol '__cxa_pure_virtual@@CXXABI_1.3'

I'm faced with the following error when I run make for the files from https://github.com/liuliu/ccv /usr/bin/ld: ../lib/liblinear.a(linear-static.o): undefined reference to symbol ...
0
votes
0answers
45 views

Checkinstall .deb package not create empty directories

I'm trying to create a .deb package for my xymon-client installation, but it is not creating the empty directories used for logs and temp files. If I run checkinstall -D make install or checkinstall ...
0
votes
0answers
14 views

Cannot find input file: `Mklefile.in'

I am playing with automake and the error I get is: config.status: error: cannot find input file: `Mklefile.in' I don't get any errors on: aclocal autoconf automake --add-missing but ...
0
votes
0answers
113 views

Caffe: /usr/bin/ld: Syntax error: “(” unexpected collect2: error: ld returned 2 exit status

I downloaded Caffe Lib for Deep Learning. I followed the instruction mentioned in its website. I used GPU-ONLY := 1 flag to use GPU computing. I've installed the NVIDIA tool kit with required ...
0
votes
0answers
24 views

Can't install spai with matlab

I'm trying to install spai-3.2 with matlab but I keep on getting this error when I do make: mex: -argcheck not a valid option. Usage: MEX [option1 ... optionN] sourcefile1 [... ...
0
votes
0answers
78 views

Problem compiling

I am trying to compile the latest ngspice (26) as a shared folder. I am using ubuntu 14.10, and have only a little understanding in the compiling process While following direction from the "compile ...
0
votes
0answers
64 views

Building and Installing ICU from Source

The setup process for ICU on Linux systems seems to be pretty standard. For whatever reason, though, it's giving me a hard time. I'm following the "official" readme instructions that come with the ...
0
votes
0answers
46 views

how to make a bootable usb from ubuntu 9.04

my boot broke after trying to install 14 from version 10. I am able to start version 9.04 from an old cd but i would like to install the latest 14 which i have now downloaded(iso) to a usb but from ...
0
votes
0answers
82 views

c++ compiler errors using make across multiple projects

I'm trying to install an LC3 assembler for school. I run the config script and type make and a several weird compiler errors pop up. I tried this building simpl and just now lc3db Here's output (the ...
0
votes
0answers
38 views

Wifi USB Driver installation fails

When ever i try to install wi fi drivers for my device WN727N, i always get stuck at make step. When ever i run make command it ends at Makefile:243: recipe for target 'LINUX' failed make: *** ...
0
votes
0answers
228 views

how do i compile & install libpng from source without apt-get

I downloaded libpng source(tar.gz) from http://libpng.org/pub/png/libpng.html. My system -> Linux mpp-qa2-5803 3.13.0-24-generic #47-Ubuntu SMP Fri May 2 23:30:00 UTC 2014 x86_64 x86_64 x86_64 ...
0
votes
0answers
92 views

make error during compiling GTK+-2

Iḿ trying to compile GTK+-2.0 It gave an error during the make phase. make[4]: Map '/home/david/src/gtk+-2.99.3/gtk' wordt binnengegaan CCLD gtk-query-immodules-3.0 /usr/bin/ld: ...
0
votes
0answers
262 views

Pre requirements missing when installing oracle database 11g Ubuntu

I'm trying to install Oracle Database 11g on Ubuntu 14.04. At the middle of executing ./runInstaller I'm getting following messages saying about missing prerequisites. This is a prerequisite ...
0
votes
0answers
375 views

Error compiling GLib in Ubuntu 14.04 (trying to install GimpShop)

I'm kinda new in Linux, so please take it easy on the most complicated stuff. I'm trying to install GimpShop. Installation guide asks me to install GLib first, and when I try to compile it using the ...
0
votes
0answers
77 views

I'm receiving a GDB test error installing Python 3.4.1 on 14.04

I'm trying to create a VirtualBox VM with Ubuntu 14.04 and Python 3.4.1. I've downloaded the source https://www.python.org/ftp/python/3.4.1/Python-3.4.1.tgz And I've updated OpenSSL to resolve a ...
0
votes
0answers
87 views

Why I obtain this compile error when I try to install a software?

I am not yet a Linux guy and I am going crazy trying to install a software compiling it on Ubuntu 14.04. This are the only provided instruction to install it: Debian First, make sure that ...
0
votes
0answers
186 views

Problems getting 5.1 Audio support over Optical Out (make not completing as expected)

after some time figuring out what's wrong with my HDMI audio I've switched to optical out which seems to have fixed the stuttering I was getting in games. Now I am having problems getting 5.1 audio ...
0
votes
0answers
26 views

jobs option in qmake

I was just compiling in qmake when i recalled that make has make -j which allows you to compile on a certain number of cores. I tried qmake -j but that failed. I looked for the term "jobs" in the ...
0
votes
0answers
146 views

recompiling ubuntu problem

I want to use fault_injection framework. When I use this script: ./failcmd.sh it show this error: failslab not available So I want to enable fault_injection with menuconfig After change ...
0
votes
0answers
125 views

make fails when build libaacs with a 'syntax error'

I'm having a problem when running make after I have configured libaacs-0.7.0, it fails with a syntax error. I got the tarball from http://download.videolan.org/pub/videolan/libaacs/0.7.0/ . I ...
0
votes
0answers
34 views

The make comand will always say there is a error

I am currently trying to install dashing, but I have this problem that no matter what language make it using it returns error 1 and I can't get rid of it. I have successfully installed it on a laptop ...
0
votes
0answers
200 views

Install Qualcomm Atheros AR8152 PCI on Kernel 2.6

I want install qualcomm atheros ar8152 pci-e fast ethernet controller driver for LInux which is having 2.6 Kernel? Please can you guide me. I tried several things including this. tar -xjvf ...
0
votes
0answers
72 views

PSI4 `make tests` errors help

Background: This is a rough follow-up to the previous question here. I am currently using Ubuntu 14.04 and wish to install PSI4. It is a chemistry computation package, which requires many things, ...
0
votes
0answers
107 views

Failed building package on Ubuntu 12.04 lts

I'm trying to install dashcast but I got the errors: /usr/bin/ld.bfd.real: /usr/local/lib/libx264.a(opencl.o): undefined reference to symbol 'dlopen@@GLIBC_2.1' /usr/bin/ld.bfd.real: note: ...
0
votes
0answers
210 views

Error 255 when installing openSSL from source

I need to build openssl from source because it's needed to build a mysql driver for android for Qt but when I do "make install" I get the following error: cms.pod around line 457: Expected text after ...
0
votes
0answers
79 views

ubuntu 12.04: Path Include in Make/options file

I am using OpenFOAM with QtCreator. Currently I have to implement some Integralfunctions with several input parameters like: Code: class IntegralFunctionB { private: double x; double y; ...
0
votes
0answers
29 views

Trying to install Kdenlive--source directory?

I am a total linux illiterate, but I'm trying to get my head down and make things work. I have downloaded Kdenlive from web, want to install in root but get error message after typing sudo make ...
0
votes
0answers
112 views

Executable not created after rosmake

This error am facing is strange and am not able to resolve this over 5 days. your help is much appreciated. I have detailed the issue below. I compiled a ros package known as tum_ardrone. before ...
0
votes
0answers
47 views

Installing Linux Kernel Modules without plus + (on ARM)

Installing Linux Kernel Modules of Version 3.4.79, but I always get a foulder with 3.4.79+. How can I install it without the +? Doing it with make ARCH=arm INSTALL_MODULE_PATH=dest modules_install
0
votes
0answers
221 views

Cannot fine syscall_32.h , header missing

When I run 'make', i get an error saying: make[1]: *** No rule to make target `/usr/src/linux-headers-3.8.0-29-generic/arch/x86/syscalls/syscall_32.tbl', needed by ...