Make is a utility that automatically builds executable programs and libraries from source code by reading files called makefiles which specify how to derive the target program.

learn more… | top users | synonyms

4
votes
1answer
334 views

Cannot find classmap.h

When i execute: make modules i get the error: make[1]: Nothing to be done for `all'. make[1]: Nothing to be done for `relocs'. CHK include/generated/uapi/linux/version.h CHK ...
1
vote
0answers
39 views

Uninstalling a compiled package

I have installed gambas2_2.23.1.orig.tar.gz from https://launchpad.net/ubuntu/+source/gambas2/2.23.1-1ubuntu3 in Ubuntu 13.10, by configuring and then making it. How can I uninstall it and reverse ...
0
votes
2answers
77 views

Where can I download pfvar.h?

I'm trying to compile a source code and it needs this header file 'pfvar.h' From where can I get it I have Ubuntu 12.04 LTS Thanks in advance
0
votes
1answer
2k views

How to clean executable using make clean?

After compiling several *.c and *.h files using make, I cleaned up the object files using make clean. However I don't know how to remove the executable. my makefile code --> CC=gcc ...
1
vote
1answer
199 views

Where does the command make search for libraries

I wonder if you can tell me the path make command uses to search for libraries and header files, I'm getting these errors "Header files missing" and I wanna check the path manually I have Ubuntu ...
0
votes
1answer
701 views

Header files missing

I'm trying to compile a source code and I'm getting many errors indicating that header files are missing from my system checking sys/ioccom.h usability... no checking sys/ioccom.h presence... no ...
1
vote
2answers
4k views

Makedepend: Command not found

I'm trying to compile a source code and I'm getting this error make[1]: makedepend: Command not found Do you have any suggestions? I have Ubuntu 12 04 LTS, 2.6.28-17 kernel and gcc version 4.6.3
0
votes
1answer
254 views

rvm how turn it on always when we open terminal in ubuntu 13.10

I am new user of 13.10 ubuntu I am facing one problem when want to install rvm, even though it is already install and using it on virtualt box. Problem is that when i start terminal and put to check ...
4
votes
1answer
3k views

collect2: error: ld returned 1 exit status

I want to install nexalign (can be downloaded from here) on ubuntu 13.10. I previously installed it on ubuntu 10 without any problem. The error I got is: gcc -O9 -Wall -Dthread -lpthread main.o ...
1
vote
3answers
25k views

Can't run make - gcc: command not found

I'm trying to follow a tutorial to get CudaMiner working on Linux. I have PAINSTAKINGLY installed NVidia drivers, Cuda 5.0 and incidentally I'm failing on the last step when I run make: make ...
0
votes
2answers
977 views

OpenCV Build Error: “Cannot open options file specified with @”

I am having trouble installing OpenCV on my machine. I run Ubuntu 12.04. I have followed this guide: http://www.raben.com/book/export/html/3 in order to install OpenCV 2.4.3 on my linux machine. ...
0
votes
1answer
69 views

link “make” command to lib and include

I want to use "make" command and link it to the include and lib path. I am using : make -I /path_to_include - L /path_to_lib but it gives me: "nothing to be done for /path_to_lib (the path is ...
2
votes
1answer
422 views

make file error, trying to install intel power gadget

I hope another Ubuntu user has tried to run Intel power gadget and knows what problem I am having. I am trying to install the power gadget, running the make file i get an error message: ...
0
votes
1answer
588 views

Making Broadcom BCM4313 driver gives error: implicit declaration of function ‘create_proc_entry’

I’m trying to build a driver for my bcm4313 wireless network adapter using these instructions from broadcom. I'm getting this error: KBUILD_NOPEDANTIC=1 make -C /lib/modules/`uname -r`/build M=`pwd` ...
1
vote
1answer
7k views

Installing gedit 3.11.2

I am trying to install gedit 3.11.2 from: https://git.gnome.org/browse/gedit for some reason, it does not work on my ubuntu 13.10 the file ./configure is not found. i followed the steps in the ...
1
vote
1answer
742 views

Missed libraries (lidn, lldap)

Command make induces error message /usr/bin/ld: cannot find -lidn /usr/bin/ld: cannot find -lldap collect2: ld returned 1 exit status make[2]: *** [../bin/SomeApp] Error 1 make[1]: *** ...
1
vote
1answer
37 views

what is “make png” command for?

I have a source code that should be compiled to create some executable files. The code is: #------------------------- # for executable file #------------------------- executables : chmod 754 ...
0
votes
1answer
114 views

How to deal with the “make install” error?

I have a source code and I have to compile it to have some .exe files. When I compile it by running the make install command, these messages appear in the terminal: if [ ! -d /opt/YHyM/ ]; then mkdir ...
1
vote
1answer
47 views

cannot find -lslink

While running make for a program installation on ubuntu 12.04 LTS, I was stuck with the following error: Could anyone help explain the cause and solution please? I'm a rookie please... Thanks ...
0
votes
1answer
248 views

Realtek rtl8723e not working at Kernel 3.5

I have a problem with my Realtek wifi card. Last time when using Kernel 3.2, all I have to do is punch in these codes while connecting to internet, everything will be solved. These codes are: sudo ...
4
votes
1answer
247 views

Make Python2.5 failed on Ubuntu 13.04

for some reason I need to install Python2.5 on Ubuntu 13.04. I tried to install it from source. However the make operation is failed with the following error: gcc -pthread -c -fno-strict-aliasing ...
1
vote
1answer
7k views

ALFA AWUS036NH driver

hello everyone i have a question about ALFA AWUS036NH network adapter, i tried this link: How do I install drivers for the Alfa AWUS036H USB wireless adapter? but when i do: make i get these ...
2
votes
3answers
15k views

“fatal error: gtk/gtk.h: No such file or directory” using make

I am trying to use make command to build. I am following this. I am compiling a code using GTK+2 and C language hp@ubuntu:~/amhello$ make make all-recursive make[1]: Entering directory ...
1
vote
1answer
521 views

Error Installing Wifi Driver on Yoga 13 (when "make)

My problem is with installing the driver: I am currently running Kali Linux on my Yoga 13 and have followed the steps here: http://www.youtube.com/watch?v=H3WdsSHo5Sw Which basically told me to ...
1
vote
1answer
3k views

Makefile:448: *** missing separator. Stop. error

The tutorial I am following is the automake hello world. I am compiling a code using GTK+2 and C language hp@ubuntu:~/amhello$ autoreconf --install configure.ac:2: installing `./install-sh' ...
1
vote
1answer
378 views

cross compiling error for helloworld program

I have already created the amhello-1.0.tar.gz using this tutorial click to open now am trying to make cross compiling but error occurs. i am following this tutorial click to open after entering ...
0
votes
3answers
3k views

Found 'solutions' to “cannot find -lcrypto” are not working for me

I am forced to install Ubuntu in order to install https://github.com/znort987/blockparser However, when running make I am encountering this: lnk -- parser /usr/bin/ld: cannot find -lcrypto ...
2
votes
2answers
4k views

How to install mpfr-3.1.2 in Ubuntu 13.04

I have Ubuntu 13.04 with processor "Intel® Core™2 Duo CPU E8400 @ 3.00GHz × 2 " I m trying to install mpfr-3.1.2 but the error is coming. "ERROR! The versions of gmp.h (5.1.3) and libgmp (5.0.5) do ...
0
votes
1answer
5k views

dogecoin wallet client dependencies (boost)

I seem to be missing something boost related. Dogecoin gives the requirements as: qt4-qmake libqt4-dev build-essential libboost-dev libboost-system-dev libboost-filesystem-dev ...
0
votes
2answers
5k views

how to build dogecoin CLI wallet

I'm trying to install dogecoin wallet, which depends on: Library Purpose Description ------- ------- ----------- libssl SSL Support Secure communications libdb4.8 Berkeley DB Blockchain & ...
3
votes
2answers
4k views

Missing asm/types.h file

I have been trying to compile a very old program actual meant for Kernel I previously had an issue Missing Modversions.h which is solved now, but there is another issue. In file included from ...
0
votes
1answer
3k views

Missing modversions.h

I`m trying to compile a program, which was actually designed for Linux OS based on kernel 2.4. When I run the make command, I get the following error ...
1
vote
1answer
703 views

I can't compile source, make doesn't work

I am trying to install "Somagic EasyCAP DC60" device driver step by step from a guide. I'm in the unpacked folder in Terminal, but make doesn't work. It says: me@me-PC:~/Desktop/somagic-easycap_1.1$ ...
1
vote
0answers
94 views

Having issues installing qemu, pixman autoreconfig missing [duplicate]

i dont understand this error message from the "make" function. qemu-1.7.0-rc1/pixman; autoreconf -v --install) /bin/sh: 1: autoreconf: not found make: * ...
5
votes
1answer
45 views

Kernel.org kernel config options different from Ubuntu ones

After compiling Ubuntu kernels for a few days (quite a fun experience, I must say), I decided to finally plunge into some vanilla kernel goodness. So far, so good. Downloaded the most recent ...
3
votes
4answers
4k views

How to completely remove my Emacs?

I downloaded Emacs source files, and installed it using make. After installing Emacs successfully, I manually removed the downloaded source files to save disk space. Now I want to remove Emacs and I ...
1
vote
1answer
16k views

Compilation error /usr/bin/ld: cannot find -lz

I encountered with this error while attempted compiling fasta36 on my Ubuntu 12.04.3 64 bit machine: /usr/bin/ld: cannot find -lz collect2: ld returned 1 exit status make: *** [fasta36] Error 1 I ...
2
votes
2answers
6k views

Unable to run make menuconfig

When I am using the command make menuconfig, then its showing sharath@sharath:~/openwrt$ make menuconfig Checking 'working-make'... ok. Checking 'case-sensitive-fs'... ok. Checking 'getopt'... ok. ...
2
votes
0answers
927 views

Undefined reference to `memcpy@GLIBC_2.14' : Building Android SDK with SmartCard API support:

I am trying to build Android emulator with SmartCard API support. I was following this manuals: one two All steps passed ok, but when I run: PCSC_INCPATH=<path_to_pcsc-lite_32bit>/src/PCSC/ ...
3
votes
2answers
11k views

'Make' command compiling errors

Im trying to locally install a program which is written in C++. I have downloaded the program and am attempting to use the "make" command to compile the program as the programs instructions dictate. ...
1
vote
1answer
3k views

Error: tcl.h not found (no such file or directory)

I'm trying to install something using the 'make' command, however it gives me the fatal error:tcl.h no such file or directory. I'm new to linux, can anyone help me?
0
votes
1answer
1k views

Compiling rtl8188ee driver fails

I am trying to compile and install the proprietary driver for my RTL8188ee Wireless card. Using make in the download directory ...
-1
votes
1answer
1k views

How do I compile lbflow 1.1?

After using "sh ./configure" command, I encountered another error during lbflow package installation (a scientific one). The sequence of operations is here with error: ./configure --disable-gts ...
2
votes
0answers
2k views

Make compiling error 'No rule to make target' when trying to install a driver

When I try to install a driver via sudo make I get these errors: make -C /lib/modules/3.8.0-31-generic/build M= make[1]: Entering directory `/usr/src/linux-headers-3.8.0-31-generic' make[2]: *** No ...
0
votes
1answer
452 views

log4cxx/logger.h or libcql/cql.hpp fatal error while doing make -j4

I am running make -j4 and I am getting below exception... userName@phx5qa01c-4e23:~/build$ make -j4 [ 1%] [ 2%] Building CXX object nda/common/loadtest/CMakeFiles/loadtester.dir/LoadTester.cc.o ...
8
votes
3answers
33k views

How to install latest cmake version in Linux/Ubuntu from command line?

I am trying to install latest cmake in my linux box and I am always getting the below exception - userName@phx5qa01c-4e23:~/build$ wget http://www.cmake.org/files/v2.8/cmake-2.8.11.tar.gz ...
2
votes
1answer
4k views

After UPDATE, I get: “no rule to build the target” running MAKE, why?

I frequently run the Ubuntu updates-manager , and after that, every time, I need to do a make to re-install my TV tuner driver (like described in here) But that time, make stops with errors: ...
-1
votes
1answer
888 views

No '/etc' Files Created during Apache Installation

I have installed Apache using the follow command: ./configure --with-apr=/usr/local/apr --with-apr-util=/usr/local/apr-util --with-pcre=/usr/local/pcre --enable-so make sudo make install Now ...
1
vote
1answer
216 views

`make install` fails apparently due to typo, but not in makefile: How to find and fix?

I'm trying to install the fujitsu-usb-touchscreen drivers from here, on Kubuntu 12.04 on my new Fujitsu LifeBook P1630. (See fujitsu-usb-touchscreen on kubuntu 13.04 (64-bit) on P1630: `make` errors.) ...
1
vote
1answer
829 views

fujitsu-usb-touchscreen on kubuntu 13.04 (64-bit) on P1630: `make` errors

I installed Kubuntu 13.04 (64-bit) on my new Fujitsu LifeBook P1630, and added just a few packages: First aptitude, then I did aptitude update && safe-upgrade, then xinput-calibrator (which ...