Tagged Questions

Make is a utility that automatically builds executable programs and libraries from source code by reading files called makefiles which specify how to derive the target program.

learn more… | top users | synonyms

0
votes
1answer
290 views

Header files missing

I'm trying to compile a source code and I'm getting many errors indicating that header files are missing from my system checking sys/ioccom.h usability... no checking sys/ioccom.h presence... no ...
1
vote
2answers
3k views

Makedepend: Command not found

I'm trying to compile a source code and I'm getting this error make[1]: makedepend: Command not found Do you have any suggestions? I have Ubuntu 12 04 LTS, 2.6.28-17 kernel and gcc version 4.6.3
0
votes
1answer
90 views

rvm how turn it on always when we open terminal in ubuntu 13.10

I am new user of 13.10 ubuntu I am facing one problem when want to install rvm, even though it is already install and using it on virtualt box. Problem is that when i start terminal and put to check ...
4
votes
1answer
2k views

collect2: error: ld returned 1 exit status

I want to install nexalign (can be downloaded from here) on ubuntu 13.10. I previously installed it on ubuntu 10 without any problem. The error I got is: gcc -O9 -Wall -Dthread -lpthread main.o ...
0
votes
0answers
100 views

Error for make-kpkg clean

When I tried make-kpkg clean it shows the following error: exec make kpkg_version=12.036+nmu2 -f /usr/share/kernel-package/ruleset/minimal.mk clean ====== making target minimal_clean [new prereqs: ...
0
votes
2answers
8k views

Can't run make - gcc: command not found

I'm trying to follow a tutorial to get CudaMiner working on Linux. I have PAINSTAKINGLY installed NVidia drivers, Cuda 5.0 and incidentally I'm failing on the last step when I run make: make ...
0
votes
0answers
51 views

Error during make

i am new to linux yet, i am trying to make robocup soccer file and at 63% i am getting following error : Linking CXX shared module collisionperceptor.so /usr/bin/ld: cannot find -ltbb collect2: ld ...
0
votes
1answer
484 views

OpenCV Build Error: “Cannot open options file specified with @”

I am having trouble installing OpenCV on my machine. I run Ubuntu 12.04. I have followed this guide: http://www.raben.com/book/export/html/3 in order to install OpenCV 2.4.3 on my linux machine. ...
0
votes
0answers
285 views

make install webconf

bonjour, j'ai commencé l’installation de nagios en suivant le guide d’installation dans le site officiel de nagios3.0b5 mais j'ai rencontré un pbm lors de la configuration du l'interface web de ...
0
votes
0answers
259 views

make: *** No rule to make --target `build' error

When I setting up development environment in docker, I got a problem like this: cd docker sudo make build make: *** No rule to make target `build'. Stop.
0
votes
1answer
37 views

link “make” command to lib and include

I want to use "make" command and link it to the include and lib path. I am using : make -I /path_to_include - L /path_to_lib but it gives me: "nothing to be done for /path_to_lib (the path is ...
1
vote
1answer
225 views

make file error, trying to install intel power gadget

I hope another Ubuntu user has tried to run Intel power gadget and knows what problem I am having. I am trying to install the power gadget, running the make file i get an error message: ...
0
votes
0answers
354 views

Installing GCC-4.8.2

I have downloaded GCC 4.8.2.tar.gz,I have also installed mpc,gmp,mpr packages. But still I am unable To install these compilers. While make file it gives me error configure: error: source directory ...
0
votes
1answer
436 views

Making Broadcom BCM4313 driver gives error: implicit declaration of function ‘create_proc_entry’

I’m trying to build a driver for my bcm4313 wireless network adapter using these instructions from broadcom. I'm getting this error: KBUILD_NOPEDANTIC=1 make -C /lib/modules/`uname -r`/build M=`pwd` ...
0
votes
0answers
96 views

Can't add new Live Wallpaper to Slidewall

I don't seem to have the "add" option on my Slidewall software for adding new Live wallpapers. Why is it happening? I'm using Ubuntu 12.04 LTS. Please help!
0
votes
0answers
55 views

Problem building asmlibrary

I've got some problem when I try to make the asmlibrary on my 64-bit ubuntu. I'm new to linux and I don't know what "make" command really does, but it gave me this: g++ -pg -o fit vjfacedetect.o ...
1
vote
1answer
3k views

Installing gedit 3.11.2

I am trying to install gedit 3.11.2 from: https://git.gnome.org/browse/gedit for some reason, it does not work on my ubuntu 13.10 the file ./configure is not found. i followed the steps in the ...
1
vote
1answer
281 views

Missed libraries (lidn, lldap)

Command make induces error message /usr/bin/ld: cannot find -lidn /usr/bin/ld: cannot find -lldap collect2: ld returned 1 exit status make[2]: *** [../bin/SomeApp] Error 1 make[1]: *** ...
0
votes
0answers
87 views

how to deal with error in make png command?

This is my source code. I should compile it to create some .exe files: ------------------------- for library ------------------------- asc : cd $(SRC_LIB_DIR)$@; make CC=$(CC) ...
0
votes
0answers
808 views

Build Error on Kernel 3.13-rc8

First time building a kernel, using the following commands on Ubuntu 12.04 LTS. I've done my due diligence to ensure that I have the dependencies listed in the kernel source documentation. $:~/ ...
1
vote
1answer
33 views

what is “make png” command for?

I have a source code that should be compiled to create some executable files. The code is: #------------------------- # for executable file #------------------------- executables : chmod 754 ...
0
votes
1answer
76 views

How to deal with the “make install” error?

I have a source code and I have to compile it to have some .exe files. When I compile it by running the make install command, these messages appear in the terminal: if [ ! -d /opt/YHyM/ ]; then mkdir ...
1
vote
0answers
400 views

HOSTCC scripts/basic/fixdep gcc: error trying to exec 'cc1': execvp: No such file or directory

hardik@ubuntu:~/ti-sdk-beagleboard-05.07.00.00/board-support/linux-3.3.7$ make ARCH=arm CROSS_COMPILE=arm-none-linux-gnueabi- uImage HOSTCC scripts/basic/fixdep gcc: error trying to exec 'cc1': ...
0
votes
1answer
160 views

Realtek rtl8723e not working at Kernel 3.5

I have a problem with my Realtek wifi card. Last time when using Kernel 3.2, all I have to do is punch in these codes while connecting to internet, everything will be solved. These codes are: sudo ...
4
votes
1answer
139 views

Make Python2.5 failed on Ubuntu 13.04

for some reason I need to install Python2.5 on Ubuntu 13.04. I tried to install it from source. However the make operation is failed with the following error: gcc -pthread -c -fno-strict-aliasing ...
0
votes
1answer
3k views

ALFA AWUS036NH driver

hello everyone i have a question about ALFA AWUS036NH network adapter, i tried this link: How do I install drivers for the Alfa AWUS036H USB wireless adapter? but when i do: make i get these ...
1
vote
2answers
7k views

“fatal error: gtk/gtk.h: No such file or directory” using make

I am trying to use make command to build. I am following this. I am compiling a code using GTK+2 and C language hp@ubuntu:~/amhello$ make make all-recursive make[1]: Entering directory ...
1
vote
1answer
353 views

Error Installing Wifi Driver on Yoga 13 (when "make)

My problem is with installing the driver: I am currently running Kali Linux on my Yoga 13 and have followed the steps here: http://www.youtube.com/watch?v=H3WdsSHo5Sw Which basically told me to ...
0
votes
1answer
2k views

Makefile:448: *** missing separator. Stop. error

i am trying to use make command to build but error occurs the tutorial i am following is click to open i am compiling a code using GTK+2 and C language hp@ubuntu:~/amhello$ autoreconf --install ...
0
votes
3answers
2k views

Found 'solutions' to “cannot find -lcrypto” are not working for me

I am forced to install ubuntu in order to install https://github.com/znort987/blockparser However, when running 'make' I am encountering this: $ make lnk -- parser /usr/bin/ld: cannot find ...
0
votes
0answers
127 views

undefined reference to 'dlopen' in installing phonetisaurus

I was trying to install phonetisaurus. In the classical steps of configure, make, make install. I was stuck on make, where it produced this error. I have googled a lot, and many suggested appending ...
1
vote
2answers
2k views

How to install mpfr-3.1.2 in Ubuntu 13.04

I have Ubuntu 13.04 with processor "Intel® Core™2 Duo CPU E8400 @ 3.00GHz × 2 " I m trying to install mpfr-3.1.2 but the error is coming. "ERROR! The versions of gmp.h (5.1.3) and libgmp (5.0.5) do ...
0
votes
1answer
5k views

dogecoin wallet client dependencies (boost)

I seem to be missing something boost related. Dogecoin gives the requirements as: qt4-qmake libqt4-dev build-essential libboost-dev libboost-system-dev libboost-filesystem-dev ...
0
votes
0answers
133 views

building/installing package with monodevelop failed, “Cannot open assembly '/usr/local/lib/…”

I want to build/install a mono/c# app I made on Linux. I made a packaging project and added a "tarball" package, using a generated autotools makefile. When i build the package and try to install it ...
0
votes
2answers
4k views

how to build dogecoin CLI wallet

I'm trying to install dogecoin wallet, which depends on: Library Purpose Description ------- ------- ----------- libssl SSL Support Secure communications libdb4.8 Berkeley DB Blockchain & ...
0
votes
0answers
28 views

Compile 64 bit kernel in 32 bit

I have an installation of 13.10 Ubuntu 32bit. Also, I've also found a way to install 64 kernel into the system (of 32bit applications). So, could I compile a 64 bit kernel in the 32 bit system with a ...
1
vote
2answers
2k views

Missing asm/types.h file

I have been trying to compile a very old program actual meant for Kernel I previously had an issue Missing Modversions.h which is solved now, but there is another issue. In file included from ...
0
votes
1answer
2k views

Missing modversions.h

I`m trying to compile a program, which was actually designed for Linux OS based on kernel 2.4. When I run the make command, I get the following error ...
1
vote
1answer
333 views

I can't compile source, make doesn't work

I am trying to install "Somagic EasyCAP DC60" device driver step by step from a guide. I'm in the unpacked folder in Terminal, but make doesn't work. It says: me@me-PC:~/Desktop/somagic-easycap_1.1$ ...
0
votes
0answers
319 views

Open Spades make problem

I'm trying to compile a game called Open Spades, but when I run "make install" or "make" it gives me this error. [ 73%] Built target Angelscript_addons [ 73%] Built target Angelscript [ 73%] Built ...
0
votes
0answers
40 views

file not recognised error when making library

Firstly I hope this is the correct stackexchange for this question. If not I'm happy to take it elsewhere. I'm trying to build a library called CBFlib. I enter the following commands into the terminal ...
0
votes
0answers
114 views

Can't install DDD and Insight

Error of DDD mv -f .deps/sigName.Tpo .deps/sigName.Po g++ -DHAVE_CONFIG_H -I. -I./.. -O2 -g -Wall -W -Wwrite-strings -trigraphs -MT strclass.o -MD -MP -MF ...
0
votes
0answers
453 views

“make[1]: arm-eabi-gcc: Command not found” when installing vmware tools

I'm trying to install vmware tools, however when it runs the vmware-config-tools.pl I'm getting the following: make[1]: arm-eabi-gcc: Command not found I have in PATH variable: ...
1
vote
0answers
94 views

Having issues installing qemu, pixman autoreconfig missing [duplicate]

i dont understand this error message from the "make" function. qemu-1.7.0-rc1/pixman; autoreconf -v --install) /bin/sh: 1: autoreconf: not found make: * ...
5
votes
1answer
36 views

Kernel.org kernel config options different from Ubuntu ones

After compiling Ubuntu kernels for a few days (quite a fun experience, I must say), I decided to finally plunge into some vanilla kernel goodness. So far, so good. Downloaded the most recent ...
2
votes
2answers
2k views

How to completely remove my Emacs?

I downloaded Emacs source files, and installed it using make. After installing Emacs successfully, I manually removed the downloaded source files to save disk space. Now I want to remove Emacs and I ...
1
vote
1answer
12k views

Compilation error /usr/bin/ld: cannot find -lz

I encountered with this error while attempted compiling fasta36 on my Ubuntu 12.04.3 64 bit machine: /usr/bin/ld: cannot find -lz collect2: ld returned 1 exit status make: *** [fasta36] Error 1 I ...
1
vote
2answers
3k views

Unable to run make menuconfig

When I am using the command make menuconfig, then its showing sharath@sharath:~/openwrt$ make menuconfig Checking 'working-make'... ok. Checking 'case-sensitive-fs'... ok. Checking 'getopt'... ok. ...
2
votes
0answers
464 views

Undefined reference to `memcpy@GLIBC_2.14' : Building Android SDK with SmartCard API support:

I am trying to build Android emulator with SmartCard API support. I was following this manuals: one two All steps passed ok, but when I run: PCSC_INCPATH=<path_to_pcsc-lite_32bit>/src/PCSC/ ...
1
vote
0answers
279 views

ZC0301 webcam Driver problem with Ubuntu distributions after 11.10

I'm having problem with Webcam and fed up with this search in Google for answers. So I've connected webcam to my computer having Ubuntu 13.10, and i tried to run luvcview program to simply see the ...