Make is a utility that automatically builds executable programs and libraries from source code by reading files called makefiles which specify how to derive the target program.

learn more… | top users | synonyms

0
votes
1answer
95 views

How do I install Chemtool?

I've downloaded the chemtool-1.6.14.tar.gz from http://ruby.chemie.uni-freiburg.de/~martin/chemtool/chemtool-1.6.14.tar.gz, then I extracted its contents into the directory: ...
0
votes
1answer
176 views

xml2 installed but not found during compilation

I'm trying to compile the lib https://github.com/bjz/gl-rs. I'm getting an error when running make: error: linking with `cc` failed: exit code: 1 (a long list of linker args follows) note: ...
1
vote
1answer
202 views

How can I compile libmtp in ubuntu

I get the following error(s) When I try to compile mtp. How can I resolve it please? Script started on Fri 23 May 2014 12:12:26 AM PDT sansari@ubuntu:~/local/src/libmtp-1.1 .3$ sudo make [sudo] ...
0
votes
1answer
154 views

Error “undefined reference to xercesc_2_7”

I've been trying to install SUMO and only recently got the ./configure to make all of the files; but, when I try to 'make' it gives the [all-recursive error 1: ...
0
votes
0answers
137 views

make fails when build libaacs with a 'syntax error'

I'm having a problem when running make after I have configured libaacs-0.7.0, it fails with a syntax error. I got the tarball from http://download.videolan.org/pub/videolan/libaacs/0.7.0/ . I ...
0
votes
0answers
35 views

The make comand will always say there is a error

I am currently trying to install dashing, but I have this problem that no matter what language make it using it returns error 1 and I can't get rid of it. I have successfully installed it on a laptop ...
0
votes
0answers
210 views

Install Qualcomm Atheros AR8152 PCI on Kernel 2.6

I want install qualcomm atheros ar8152 pci-e fast ethernet controller driver for LInux which is having 2.6 Kernel? Please can you guide me. I tried several things including this. tar -xjvf ...
1
vote
1answer
79 views

Installation of .c files in phylip

I am trying to install .C functions of PHYLIP in Linux/ubuntu. I read documentation and it mentioned it is very easy compilation and of .C functions: To make executables, use your C compiler. It ...
0
votes
0answers
86 views

PSI4 `make tests` errors help

Background: This is a rough follow-up to the previous question here. I am currently using Ubuntu 14.04 and wish to install PSI4. It is a chemistry computation package, which requires many things, ...
1
vote
2answers
207 views

How to create a txt log file of a “make install”?

I trying to install a program and I would like to see a txt file with the details of the operation. I think it is called a log file, am I right ? Once, someone told me to do this command: `make ...
1
vote
1answer
44 views

Couldn't install make [duplicate]

I try to install make on Ubuntu 12.04 LTS Server apt-get install make But I observe error: Temporary failure resolving 'de.archive.ubuntu.com Failed to fetch ...
0
votes
0answers
116 views

Failed building package on Ubuntu 12.04 lts

I'm trying to install dashcast but I got the errors: /usr/bin/ld.bfd.real: /usr/local/lib/libx264.a(opencl.o): undefined reference to symbol 'dlopen@@GLIBC_2.1' /usr/bin/ld.bfd.real: note: ...
2
votes
1answer
215 views

Compile error when trying to run make

I have the following error when trying to run make command, /usr/bin/ld: skipping incompatible /usr/lib/gcc/x86_64-linux-gnu/4.7/../../../libcppunit.a when searching for -lcppunit /usr/bin/ld: ...
0
votes
0answers
220 views

Error 255 when installing openSSL from source

I need to build openssl from source because it's needed to build a mysql driver for android for Qt but when I do "make install" I get the following error: cms.pod around line 457: Expected text after ...
1
vote
0answers
323 views

WARNING: 'automake-1.11' is probably too old [closed]

I am trying to install a package. When doing make command, I got an error as: make[5]: Entering directory ...
1
vote
1answer
3k views

autogen.sh script failing with autoreconf2.50: automake failed with exit status: 1

I recently heard about the Maynard desktop, a replacement for LXDE on the Raspberry Pi, and I really liked it. I was just planning on installing it on my Pi, until I found out I could compile it for ...
0
votes
1answer
143 views

Install something without make install [closed]

I have been struggling for few days trying to install a software. I'm not actually working on Ubuntu but I think the steps to do are the same. Working on a gentoo (The operating system of the Robot ...
3
votes
2answers
95 views

Is there a plugin for the terminal which allow to detect and open files?

I'm looking for a terminal plugin/extension that would allow me to detect files path in terminal output and open them in a text editor by clicking on them. The perfect solution would open the file at ...
0
votes
1answer
66 views

debian package creation without a configure script

I've been trying to package an in house code project but have been having trouble. I can create a package, but the actual binaries are not installed when I run sudo dpkg -i ...
2
votes
0answers
80 views

I get an error when I try to compile DAR on 12.04, how can I fix solve this?

Install DAR 2.4.12 from source because latest version ubuntu package is 2.4.2. ./configure --prefix=/usr dar and libdar have been successfully configured with the following parameters: LIBDAR ...
0
votes
1answer
228 views

Linking CXX executable RemoteZynAddSubFx

I'm trying to build the latest version of LMMS v1.0.0 and I'm running into this error Linking CXX executable RemoteZynAddSubFx /usr/bin/ld: cannot find -lXft /usr/bin/ld: cannot find -lfontconfig ...
0
votes
1answer
1k views

Unknown type name gcc

I'm trying to compile this source code http://nrg.cs.ucl.ac.uk/mptcp/mptcp_userland_0.1.tar.gz and I'm getting unknown type name 'u8' among other types (u_int, u_char, u_long....etc) I have Ubuntu ...
0
votes
1answer
261 views

Problem building an rtl8723 driver

We all know the problems with RTL8723 wireless card and some people achieved to install but i can't. I have Ubuntu 12.10. When I do the make in terminal, it gives me this error make -C ...
4
votes
0answers
241 views

Cannot find classmap.h

When i execute: make modules i get the error: make[1]: Nothing to be done for `all'. make[1]: Nothing to be done for `relocs'. CHK include/generated/uapi/linux/version.h CHK ...
1
vote
0answers
39 views

Uninstalling a compiled package

I have installed gambas2_2.23.1.orig.tar.gz from https://launchpad.net/ubuntu/+source/gambas2/2.23.1-1ubuntu3 in Ubuntu 13.10, by configuring and then making it. How can I uninstall it and reverse ...
0
votes
2answers
64 views

Where can I download pfvar.h?

I'm trying to compile a source code and it needs this header file 'pfvar.h' From where can I get it I have Ubuntu 12.04 LTS Thanks in advance
0
votes
1answer
1k views

How to clean executable using make clean?

After compiling several *.c and *.h files using make, I cleaned up the object files using make clean. However I don't know how to remove the executable. my makefile code --> CC=gcc ...
1
vote
1answer
139 views

Where does the command make search for libraries

I wonder if you can tell me the path make command uses to search for libraries and header files, I'm getting these errors "Header files missing" and I wanna check the path manually I have Ubuntu ...
0
votes
1answer
511 views

Header files missing

I'm trying to compile a source code and I'm getting many errors indicating that header files are missing from my system checking sys/ioccom.h usability... no checking sys/ioccom.h presence... no ...
1
vote
2answers
3k views

Makedepend: Command not found

I'm trying to compile a source code and I'm getting this error make[1]: makedepend: Command not found Do you have any suggestions? I have Ubuntu 12 04 LTS, 2.6.28-17 kernel and gcc version 4.6.3
0
votes
1answer
155 views

rvm how turn it on always when we open terminal in ubuntu 13.10

I am new user of 13.10 ubuntu I am facing one problem when want to install rvm, even though it is already install and using it on virtualt box. Problem is that when i start terminal and put to check ...
4
votes
1answer
2k views

collect2: error: ld returned 1 exit status

I want to install nexalign (can be downloaded from here) on ubuntu 13.10. I previously installed it on ubuntu 10 without any problem. The error I got is: gcc -O9 -Wall -Dthread -lpthread main.o ...
0
votes
3answers
17k views

Can't run make - gcc: command not found

I'm trying to follow a tutorial to get CudaMiner working on Linux. I have PAINSTAKINGLY installed NVidia drivers, Cuda 5.0 and incidentally I'm failing on the last step when I run make: make ...
0
votes
1answer
742 views

OpenCV Build Error: “Cannot open options file specified with @”

I am having trouble installing OpenCV on my machine. I run Ubuntu 12.04. I have followed this guide: http://www.raben.com/book/export/html/3 in order to install OpenCV 2.4.3 on my linux machine. ...
0
votes
1answer
47 views

link “make” command to lib and include

I want to use "make" command and link it to the include and lib path. I am using : make -I /path_to_include - L /path_to_lib but it gives me: "nothing to be done for /path_to_lib (the path is ...
2
votes
1answer
325 views

make file error, trying to install intel power gadget

I hope another Ubuntu user has tried to run Intel power gadget and knows what problem I am having. I am trying to install the power gadget, running the make file i get an error message: ...
0
votes
1answer
520 views

Making Broadcom BCM4313 driver gives error: implicit declaration of function ‘create_proc_entry’

I’m trying to build a driver for my bcm4313 wireless network adapter using these instructions from broadcom. I'm getting this error: KBUILD_NOPEDANTIC=1 make -C /lib/modules/`uname -r`/build M=`pwd` ...
1
vote
1answer
5k views

Installing gedit 3.11.2

I am trying to install gedit 3.11.2 from: https://git.gnome.org/browse/gedit for some reason, it does not work on my ubuntu 13.10 the file ./configure is not found. i followed the steps in the ...
1
vote
1answer
508 views

Missed libraries (lidn, lldap)

Command make induces error message /usr/bin/ld: cannot find -lidn /usr/bin/ld: cannot find -lldap collect2: ld returned 1 exit status make[2]: *** [../bin/SomeApp] Error 1 make[1]: *** ...
1
vote
1answer
35 views

what is “make png” command for?

I have a source code that should be compiled to create some executable files. The code is: #------------------------- # for executable file #------------------------- executables : chmod 754 ...
0
votes
1answer
94 views

How to deal with the “make install” error?

I have a source code and I have to compile it to have some .exe files. When I compile it by running the make install command, these messages appear in the terminal: if [ ! -d /opt/YHyM/ ]; then mkdir ...
1
vote
1answer
41 views

cannot find -lslink

While running make for a program installation on ubuntu 12.04 LTS, I was stuck with the following error: Could anyone help explain the cause and solution please? I'm a rookie please... Thanks ...
0
votes
1answer
201 views

Realtek rtl8723e not working at Kernel 3.5

I have a problem with my Realtek wifi card. Last time when using Kernel 3.2, all I have to do is punch in these codes while connecting to internet, everything will be solved. These codes are: sudo ...
4
votes
1answer
192 views

Make Python2.5 failed on Ubuntu 13.04

for some reason I need to install Python2.5 on Ubuntu 13.04. I tried to install it from source. However the make operation is failed with the following error: gcc -pthread -c -fno-strict-aliasing ...
1
vote
1answer
5k views

ALFA AWUS036NH driver

hello everyone i have a question about ALFA AWUS036NH network adapter, i tried this link: How do I install drivers for the Alfa AWUS036H USB wireless adapter? but when i do: make i get these ...
1
vote
3answers
11k views

“fatal error: gtk/gtk.h: No such file or directory” using make

I am trying to use make command to build. I am following this. I am compiling a code using GTK+2 and C language hp@ubuntu:~/amhello$ make make all-recursive make[1]: Entering directory ...
1
vote
1answer
460 views

Error Installing Wifi Driver on Yoga 13 (when "make)

My problem is with installing the driver: I am currently running Kali Linux on my Yoga 13 and have followed the steps here: http://www.youtube.com/watch?v=H3WdsSHo5Sw Which basically told me to ...
0
votes
1answer
3k views

Makefile:448: *** missing separator. Stop. error

i am trying to use make command to build but error occurs the tutorial i am following is click to open i am compiling a code using GTK+2 and C language hp@ubuntu:~/amhello$ autoreconf --install ...
1
vote
1answer
252 views

cross compiling error for helloworld program

I have already created the amhello-1.0.tar.gz using this tutorial click to open now am trying to make cross compiling but error occurs. i am following this tutorial click to open after entering ...
0
votes
3answers
2k views

Found 'solutions' to “cannot find -lcrypto” are not working for me

I am forced to install ubuntu in order to install https://github.com/znort987/blockparser However, when running 'make' I am encountering this: $ make lnk -- parser /usr/bin/ld: cannot find ...