Make is a utility that automatically builds executable programs and libraries from source code by reading files called makefiles which specify how to derive the target program.

learn more… | top users | synonyms

1
vote
1answer
44 views

Installation of .c files in phylip

I am trying to install .C functions of PHYLIP in Linux/ubuntu. I read documentation and it mentioned it is very easy compilation and of .C functions: To make executables, use your C compiler. It ...
0
votes
0answers
37 views

PSI4 `make tests` errors help

Background: This is a rough follow-up to the previous question here. I am currently using Ubuntu 14.04 and wish to install PSI4. It is a chemistry computation package, which requires many things, ...
1
vote
2answers
70 views

How to create a txt log file of a “make install”?

I trying to install a program and I would like to see a txt file with the details of the operation. I think it is called a log file, am I right ? Once, someone told me to do this command: `make ...
1
vote
1answer
38 views

Couldn't install make [duplicate]

I try to install make on Ubuntu 12.04 LTS Server apt-get install make But I observe error: Temporary failure resolving 'de.archive.ubuntu.com Failed to fetch ...
0
votes
0answers
57 views

Failed building package on Ubuntu 12.04 lts

I'm trying to install dashcast but I got the errors: /usr/bin/ld.bfd.real: /usr/local/lib/libx264.a(opencl.o): undefined reference to symbol 'dlopen@@GLIBC_2.1' /usr/bin/ld.bfd.real: note: ...
2
votes
1answer
98 views

Compile error when trying to run make

I have the following error when trying to run make command, /usr/bin/ld: skipping incompatible /usr/lib/gcc/x86_64-linux-gnu/4.7/../../../libcppunit.a when searching for -lcppunit /usr/bin/ld: ...
0
votes
0answers
186 views

Error 255 when installing openSSL from source

I need to build openssl from source because it's needed to build a mysql driver for android for Qt but when I do "make install" I get the following error: cms.pod around line 457: Expected text after ...
1
vote
0answers
127 views

WARNING: 'automake-1.11' is probably too old [closed]

I am trying to install a package. When doing make command, I got an error as: make[5]: Entering directory ...
0
votes
1answer
711 views

autogen.sh script failing with autoreconf2.50: automake failed with exit status: 1

I recently heard about the Maynard desktop, a replacement for LXDE on the Raspberry Pi, and I really liked it. I was just planning on installing it on my Pi, until I found out I could compile it for ...
0
votes
1answer
61 views

Install something without make install [closed]

I have been struggling for few days trying to install a software. I'm not actually working on Ubuntu but I think the steps to do are the same. Working on a gentoo (The operating system of the Robot ...
2
votes
1answer
58 views

Is there a plugin for the terminal which allow to detect and open files?

I'm looking for a terminal plugin/extension that would allow me to detect files path in terminal output and open them in a text editor by clicking on them. The perfect solution would open the file at ...
0
votes
0answers
40 views

ubuntu 12.04: Path Include in Make/options file

I am using OpenFOAM with QtCreator. Currently I have to implement some Integralfunctions with several input parameters like: Code: class IntegralFunctionB { private: double x; double y; ...
0
votes
1answer
46 views

debian package creation without a configure script

I've been trying to package an in house code project but have been having trouble. I can create a package, but the actual binaries are not installed when I run sudo dpkg -i ...
2
votes
0answers
53 views

I get an error when I try to compile DAR on 12.04, how can I fix solve this?

Install DAR 2.4.12 from source because latest version ubuntu package is 2.4.2. ./configure --prefix=/usr dar and libdar have been successfully configured with the following parameters: LIBDAR ...
0
votes
1answer
114 views

Linking CXX executable RemoteZynAddSubFx

I'm trying to build the latest version of LMMS v1.0.0 and I'm running into this error Linking CXX executable RemoteZynAddSubFx /usr/bin/ld: cannot find -lXft /usr/bin/ld: cannot find -lfontconfig ...
0
votes
0answers
19 views

Trying to install Kdenlive--source directory?

I am a total linux illiterate, but I'm trying to get my head down and make things work. I have downloaded Kdenlive from web, want to install in root but get error message after typing sudo make ...
1
vote
0answers
43 views

I don't seem to have iwlconfig on my kernel

I recently compiled a Linux 3.0 Kernel from the latest stable Ubuntu release (Kernel 3.2.0 I believe) following all the steps you can see in this page: ...
0
votes
1answer
6k views

Install error---make: *** No targets specified and no makefile found. Stop

apcoer@apcoer-Aspire-Series:~$ cd Desktop apcoer@apcoer-Aspire-Series:~/Desktop$ cd libgraph-1.0.2 apcoer@apcoer-Aspire-Series:~/Desktop/libgraph-1.0.2$ ./configure checking build system type... ...
0
votes
0answers
71 views

Executable not created after rosmake

This error am facing is strange and am not able to resolve this over 5 days. your help is much appreciated. I have detailed the issue below. I compiled a ros package known as tum_ardrone. before ...
0
votes
0answers
33 views

Installing Linux Kernel Modules without plus + (on ARM)

Installing Linux Kernel Modules of Version 3.4.79, but I always get a foulder with 3.4.79+. How can I install it without the +? Doing it with make ARCH=arm INSTALL_MODULE_PATH=dest modules_install
0
votes
1answer
431 views

Unknown type name gcc

I'm trying to compile this source code http://nrg.cs.ucl.ac.uk/mptcp/mptcp_userland_0.1.tar.gz and I'm getting unknown type name 'u8' among other types (u_int, u_char, u_long....etc) I have Ubuntu ...
0
votes
1answer
177 views

Problem building an rtl8723 driver

We all know the problems with RTL8723 wireless card and some people achieved to install but i can't. I have Ubuntu 12.10. When I do the make in terminal, it gives me this error make -C ...
0
votes
0answers
191 views

Cannot fine syscall_32.h , header missing

When I run 'make', i get an error saying: make[1]: *** No rule to make target `/usr/src/linux-headers-3.8.0-29-generic/arch/x86/syscalls/syscall_32.tbl', needed by ...
2
votes
0answers
118 views

Cannot find classmap.h

When i execute: make modules i get the error: make[1]: Nothing to be done for `all'. make[1]: Nothing to be done for `relocs'. CHK include/generated/uapi/linux/version.h CHK ...
1
vote
0answers
37 views

Uninstalling a compiled package

I have installed gambas2_2.23.1.orig.tar.gz from https://launchpad.net/ubuntu/+source/gambas2/2.23.1-1ubuntu3 in Ubuntu 13.10, by configuring and then making it. How can I uninstall it and reverse ...
0
votes
2answers
53 views

Where can I download pfvar.h?

I'm trying to compile a source code and it needs this header file 'pfvar.h' From where can I get it I have Ubuntu 12.04 LTS Thanks in advance
0
votes
0answers
27 views

Kernel compiling question about “.config” file

I am in the middle of compiling a new linux kernel targeted at my Acer Aspire One Laptop with an Intel Atom processor. I'm just playing as a self teach exercise. So far, I have made my new config, ...
0
votes
0answers
583 views

“Error : No targets specified and no makefile found” when configuring eclipse for stm32 development

I'm trying to configure eclipse for stm32 development, and I followed some video tutorial on Youtube and it was OK till the last few steps when an error occured I'm working on Ubuntu 12.10 and ...
0
votes
1answer
235 views

How to clean executable using make clean?

After compiling several *.c and *.h files using make, I cleaned up the object files using make clean. However I don't know how to remove the executable. my makefile code --> CC=gcc ...
1
vote
1answer
76 views

Where does the command make search for libraries

I wonder if you can tell me the path make command uses to search for libraries and header files, I'm getting these errors "Header files missing" and I wanna check the path manually I have Ubuntu ...
0
votes
1answer
228 views

Header files missing

I'm trying to compile a source code and I'm getting many errors indicating that header files are missing from my system checking sys/ioccom.h usability... no checking sys/ioccom.h presence... no ...
1
vote
2answers
2k views

Makedepend: Command not found

I'm trying to compile a source code and I'm getting this error make[1]: makedepend: Command not found Do you have any suggestions? I have Ubuntu 12 04 LTS, 2.6.28-17 kernel and gcc version 4.6.3
0
votes
1answer
72 views

rvm how turn it on always when we open terminal in ubuntu 13.10

I am new user of 13.10 ubuntu I am facing one problem when want to install rvm, even though it is already install and using it on virtualt box. Problem is that when i start terminal and put to check ...
4
votes
1answer
1k views

collect2: error: ld returned 1 exit status

I want to install nexalign (can be downloaded from here) on ubuntu 13.10. I previously installed it on ubuntu 10 without any problem. The error I got is: gcc -O9 -Wall -Dthread -lpthread main.o ...
0
votes
0answers
83 views

Error for make-kpkg clean

When I tried make-kpkg clean it shows the following error: exec make kpkg_version=12.036+nmu2 -f /usr/share/kernel-package/ruleset/minimal.mk clean ====== making target minimal_clean [new prereqs: ...
0
votes
1answer
4k views

Can't run make - gcc: command not found

I'm trying to follow a tutorial to get CudaMiner working on Linux. I have PAINSTAKINGLY installed NVidia drivers, Cuda 5.0 and incidentally I'm failing on the last step when I run make: make ...
0
votes
0answers
42 views

Error during make

i am new to linux yet, i am trying to make robocup soccer file and at 63% i am getting following error : Linking CXX shared module collisionperceptor.so /usr/bin/ld: cannot find -ltbb collect2: ld ...
0
votes
1answer
321 views

OpenCV Build Error: “Cannot open options file specified with @”

I am having trouble installing OpenCV on my machine. I run Ubuntu 12.04. I have followed this guide: http://www.raben.com/book/export/html/3 in order to install OpenCV 2.4.3 on my linux machine. ...
0
votes
0answers
263 views

make install webconf

bonjour, j'ai commencé l’installation de nagios en suivant le guide d’installation dans le site officiel de nagios3.0b5 mais j'ai rencontré un pbm lors de la configuration du l'interface web de ...
0
votes
0answers
225 views

make: *** No rule to make --target `build' error

When I setting up development environment in docker, I got a problem like this: cd docker sudo make build make: *** No rule to make target `build'. Stop.
0
votes
1answer
32 views

link “make” command to lib and include

I want to use "make" command and link it to the include and lib path. I am using : make -I /path_to_include - L /path_to_lib but it gives me: "nothing to be done for /path_to_lib (the path is ...
1
vote
1answer
181 views

make file error, trying to install intel power gadget

I hope another Ubuntu user has tried to run Intel power gadget and knows what problem I am having. I am trying to install the power gadget, running the make file i get an error message: ...
0
votes
0answers
339 views

Installing GCC-4.8.2

I have downloaded GCC 4.8.2.tar.gz,I have also installed mpc,gmp,mpr packages. But still I am unable To install these compilers. While make file it gives me error configure: error: source directory ...
0
votes
1answer
312 views

Making Broadcom BCM4313 driver gives error: implicit declaration of function ‘create_proc_entry’

I’m trying to build a driver for my bcm4313 wireless network adapter using these instructions from broadcom. I'm getting this error: KBUILD_NOPEDANTIC=1 make -C /lib/modules/`uname -r`/build M=`pwd` ...
0
votes
0answers
80 views

Can't add new Live Wallpaper to Slidewall

I don't seem to have the "add" option on my Slidewall software for adding new Live wallpapers. Why is it happening? I'm using Ubuntu 12.04 LTS. Please help!
0
votes
0answers
47 views

Problem building asmlibrary

I've got some problem when I try to make the asmlibrary on my 64-bit ubuntu. I'm new to linux and I don't know what "make" command really does, but it gave me this: g++ -pg -o fit vjfacedetect.o ...
1
vote
1answer
2k views

Installing gedit 3.11.2

I am trying to install gedit 3.11.2 from: https://git.gnome.org/browse/gedit for some reason, it does not work on my ubuntu 13.10 the file ./configure is not found. i followed the steps in the ...
1
vote
1answer
206 views

Missed libraries (lidn, lldap)

Command make induces error message /usr/bin/ld: cannot find -lidn /usr/bin/ld: cannot find -lldap collect2: ld returned 1 exit status make[2]: *** [../bin/SomeApp] Error 1 make[1]: *** ...
0
votes
0answers
72 views

how to deal with error in make png command?

This is my source code. I should compile it to create some .exe files: ------------------------- for library ------------------------- asc : cd $(SRC_LIB_DIR)$@; make CC=$(CC) ...
0
votes
0answers
783 views

Build Error on Kernel 3.13-rc8

First time building a kernel, using the following commands on Ubuntu 12.04 LTS. I've done my due diligence to ensure that I have the dependencies listed in the kernel source documentation. $:~/ ...