The tag has no usage guidance.

learn more… | top users | synonyms

0
votes
0answers
8 views

ubuntu library path error while configuruing library

while configuring the library i am getting the below error. configure: error: Required library libtrace 3.0.7 or later not found; use LDFLAGS to specify library location The thing is that i have ...
0
votes
0answers
16 views

/usr/bin/ld: cannot find -lrw_lua_s

So.. I am trying to compile a library, but running make has become troublesome, as I run into this error.. I think the library it is trying to use is located in that same directory I run make from as ...
0
votes
0answers
15 views

How do i install libraries for tcl programs?

I want to install all the libraries required to run tcl.However i dont have any error asking me the absence of any lib but i dont want to get stuck in middle of a presentation. Also nam is giving a ...
0
votes
1answer
22 views

apt-get not work and putty not connect

When I want to login to ssh by putty show me this errors: Connection refused and when I connect to Ubuntu via VNC when I login I see this errors: apt-config: error while loading shared libraries: ...
1
vote
0answers
16 views

Error loading libQt3Support.so.4

I am trying to install this software called Vlab. Its a Plant modelling software. I am following their instruction to install their software. After that if i run the command vlab-splash which ...
0
votes
1answer
35 views

c++ boost library problem: cannot find -lboost_system ld returned 1 exit status

I have a problem with boost. After I installed boost with following command sudo apt-get install python-dev sudo apt-get install libboost-python1.54 sudo apt-get install libboost-system1.54 ...
-1
votes
1answer
16 views

Undefined reference to 'CRYPT_NUM_LOCK'

I am new to ubuntu and currently i am using 12.04 version of ubuntu. i am trying to compile a program using openssl libraries using gcc compiler. But it is giving errors: Undefined reference to ...
0
votes
1answer
58 views

Wine overrides for FONTSUB.DLL not working

I have been scouring the internet for about 4 hours now and cannot get this working! I am just trying to install Navicat Premium 11 x64 using Wine. Each time, I have ran winecfg and set up the ...
1
vote
1answer
20 views

Is it safe to install old libraries? Wine issue

I'm trying to run Medal of Honor Allied Assault on my xubuntu 14.04 box. Yet, I get the following error: error while loading shared libraries: libstdc++.so.5: cannot open shared object file: No such ...
0
votes
0answers
102 views

How to solve linking problem to build a project?

I'm trying to run "make all" to build a project, and keep getting error CXX/LD -o .build_release/tools/compute_image_mean.bin /usr/lib/x86_64-linux-gnu/libunwind.so.8: undefined reference to ...
0
votes
1answer
32 views

How to install steam client?

i need some help. i just downloaded the steam client from the web and i cant open it because some software is missing the leyend says: You are missing the following 32-bit libraries, and Steam may ...
0
votes
1answer
45 views

error loading shared libraries: libcgmanager.so.0: No such file or directory

I was trying to install CasparCG on Ubuntu 15.10 and now it's throwing a library error! bin/casparcg: error while loading shared libraries: libcgmanager.so.0:cannot open shared object file: No such ...
0
votes
0answers
34 views

Libraries problem

I am trying to open a demo (arahweave), but when I click on its start button nothing happens. When I write the whole address in the terminal I get: error while loading shared libraries: libXt.so.6: ...
0
votes
1answer
57 views

error while loading shared libraries: libjpeg.so.62: cannot open shared object file: No such file or directory [duplicate]

I am not sure if I must ask this in blender stakcexchange or in here. However, the problem is that when I run a custom compiled version of Blender(that wasn't compiled by me), I see this: ./blender: ...
0
votes
0answers
44 views

Missing Steam Packages

In Ubuntu 14.04, when I try to install steam via .deb file, it shows: Steam needs to install these additional packages: libgl1-mesa-dri:i386, libgl1-mesa-glx:i386, libc6:i386 Then it asks for my ...
0
votes
1answer
7 views

About plugin/library/add-on package

I found I can install almost everything using terminal. But how can I get the packaged version of those softwares especially lib files & media codec in case I'm offline.
0
votes
0answers
9 views

New Library Location and Auto Mount Secondary Drive Problem [duplicate]

This problem has two parts. I want to change the location of say 'Pictures' from the currently empty default to my storage HDD (Storage HDD, Ubuntu SSD, Windows SSD). The way I want to do this is by ...
1
vote
0answers
71 views

squeak: could not find any display driver

I am building the vm for squeak on Ubuntu 14.04 32-bit. It is failing to call entry points to libraries, whether these libraries are statically linked or loaded or not loaded. I have been doing some ...
0
votes
1answer
32 views

Removing R libraries in protected /usr/ paths

I am familiar with Unix as an operating system, but not in the general logic of how developers decide to organize application library locations. Take R, for example. Installing R on ubuntu can be ...
0
votes
0answers
9 views

What's the deal with libuv always being so out of date? [duplicate]

I'm looking at using some tools that require libuv, but I noticed that ubuntu's has been behind for quite some while. Is there any reason why there isn't at the very least a realiable PPA for the ...
2
votes
2answers
288 views

Can't access cairo.h

I've installed cairo-1.4.14 using make install, but after trying to compile my code: fatal error: cairo.h: No such file or directory #include <cairo.h> ^ I compile using ...
0
votes
0answers
12 views

Can't install library in Ubuntu 14.04 [duplicate]

I tried to install cairo-1.14.4 library. After make install: /usr/bin/install: cannot create regular file '/usr/local/lib/libcairo.so.2.11400.4': Permission denied
1
vote
1answer
122 views

Cannot seem to install libcurl4-openssl-dev package

I am unable to install this package. This is what I get when I used apt-get to install it. Running 14.04 64bit. Reading package lists... Done Building dependency tree Reading state ...
0
votes
0answers
106 views

Package unmet dependecies Perl-base Ubuntu 14.04 64 bit

i'm trying to sudo apt-get upgrade , but there is error. it happened when i try to install too. running sudo apt-get -f install here is the error return : dionajie@dionajie-Notebook:~$ sudo ...
2
votes
2answers
143 views

/usr/bin/ld: cannot find -lX11

https://github.com/laazyboy13/linux-csgo-external/issues/6 How do I get it to find libx11-dev? william@william-elementarylinux:~/csgohack$ make Linking CXX executable build/csgo_external /usr/bin/ld: ...
3
votes
1answer
90 views

Unable to install Guitar Pro 6 32bit on a 32bit system

I had to reinstall Kubuntu 15.10 (32bit) and when I try to reinstall Guitar Pro 6 (32bit) it failed. The strange thing is that it was working perfectly fine before with same OS, same PC, same Guitar ...
0
votes
0answers
29 views

How to cross compile ARM lib for use in xCode on Mac OS X?

How to cross compile a static lib in C for armv7 architecture to be used in iOS app projects developed and linked in xCode on Mac OS X machine?
0
votes
0answers
37 views

Procedure to install and #include downloaded development library to C file

Lets continue from this previous question. I see that the general procedure is: Download .tar.gz file Extract the file with any method (eg. tar -xvzf SDL2-2.0.0.tar.gz) Go to the extracted folder ...
0
votes
1answer
27 views

Is there a enviornmental variable for the path to header files?

I am installing some software, and I get an error that says Nux.h not found. I have the Nux.h header, in my downloads file folder, but I don't know where it should go. where do ".h" files go? Also, ...
0
votes
2answers
573 views

how can i install Boost 1.55 on Ubuntu 15.10?

How can i install, from packages, Boost 1.55 on Ubuntu 15.10? For example, the repository (via Synaptic) only shows Boost 1.58 only, and Emulationstation (the version i have as tarball) uses Boost ...
1
vote
1answer
46 views

Mathplot lib error on Python

I am trying to run a code on python which needs mathplotlib. By typing: python3 mouse_click.py gives the error ImportError: No module named 'matplotlib' For installing sudo apt-get install ...
2
votes
1answer
33 views

How to compile code without having the needed library 'installed' in your system?

In one of my projects in working with the SDL 2.0 libraries. My computer went kaput last night and at my uni my profile doesn't have sudo powers. Is there a way to compile and run my code without ...
0
votes
0answers
62 views

Problem in installing hdf5

I am totally new in Ubuntu. I am trying to install hdf5-1.8.15 library but I got this error: #007: H5FDsec2.c line 722 in H5FD_sec2_read(): file read failed: time = Wed Sep 30 15:24:48 2015 , ...
0
votes
2answers
27 views

How do I find out what version of “libosinfo” I am running?

I am running Ubuntu 14.04. I tried the whereis, whatis, locate, and find commands. I think it is installed. I cannot install it again. I use apt-get to install packages. virt-manager requires this be ...
0
votes
1answer
99 views

Can't install libstdc++

I'm using Ubuntu 15.04, here what I've got: ... libstdc++6-4.9-dbg-arm64-cross : Conflicts: libstdc++6-4.8-dbg-arm64-cross but 4.8.4-1ubuntu15cross0.15 is to be installed ...
0
votes
0answers
91 views

I want to install pyv8 for using python-Wappalyzer but I cant fix this error

at the first I ran this: pip install -e git://github.com/brokenseal/PyV8-OS-X#egg=pyv8 this message showed : Obtaining pyv8 from git+git://github.com/brokenseal/PyV8-OS-X#egg=pyv8 Updating ...
1
vote
1answer
354 views

Package was not found in the pkg-config search path

I am trying to install WaoN. When I run sudo make -f Makefile.waon it gives me the following errors: gcc -Wall -march=pentium -O3 -ffast-math `pkg-config --cflags fftw3` `pkg-config --cflags sndfile` ...
0
votes
1answer
70 views

How to install HElib?

I unzipped file HElib-master.zip on my folder Downloads. Then I obtained my file fhe.a in folder Downloads/HElib-master/src but when I run command make Test_General as indicated here ...
3
votes
1answer
83 views

ubuntu phone questions, about libraries, ubuntu-sdk, and QML

I'm trying to make an app for Ubuntu phone but I've lots of questions. If my app depends from a library as qxmpp, what is better? Add a local copy of the library with my app, or use the system ...
3
votes
1answer
104 views

AC3D - No such file or directory

I just downloaded AC3D and extracted the zip in a folder in my home folder. I opened a terminal, CD'd to the folder and typed ./ac3d. But I get the following error message every time: bash: ./ac3d: ...
4
votes
1answer
261 views

pdfpc Installation

I have recently started to work with ubuntu and I have ubuntu 15.04 installed on my computer. This question for me is more than just how to install pdfpc but is also about learning how applications ...
1
vote
1answer
81 views

libarb.so & libflint.so.13: cannot open shared object file: No such file or directory

I installed arb and try to run this code: #include "arb.h" int main() { arb_t x; arb_init(x); arb_const_pi(x, 50 * 3.33); arb_printn(x, 50, 0); printf("\n"); printf("Computed ...
0
votes
1answer
1k views

error loading shared libraries: libssl.so.1.0.0

A whole pile of my applications are no longer launching (xchat, vmware, etc) with this error. xchat: error while loading shared libraries: libssl.so.1.0.0: cannot open shared object file: No such ...
0
votes
1answer
27 views

S2n library doesn't link with arm

When I am trying to compile amazon's s2n(opnen source TLS implementation) library on arm64, It gives me the error hidden symbol 'pthread_atfork' in /usr/lib/aarch64-linux-gnu/libpthread_nonshared.a ...
0
votes
1answer
226 views

Problem installing dolphin emulator?

I'm running Ubuntu 14.04 64 bit on my Laptop. I'm trying to install dolphin emulator on my system Here is the terminal output. Selecting previously unselected package dolphin-emu. (Reading database ...
0
votes
1answer
306 views

How to Fix error related to libicudata.so

I'm getting following error when invoking a binary file from command line: error while loading shared libraries: libicudata.so.55: cannot open shared object file: No such file or directory I tried ...
1
vote
0answers
347 views

Trouble with Qt libraries while installing Gnu Octave 4.0.0 from source

I know that similar problems to this have arisen. I have tried all of the debugging techniques that I have heard of. I have made sure to download all of the dependencies for Qt4 from the following ...
0
votes
2answers
29 views

editing static *.a library

I was wondering if it's possible to see the content of one of the libraries on my system. I went to usr/lib directory with my terminal. and I tried nano and vi but I couldn't see their content. Is ...
0
votes
0answers
65 views

how to get SEC1110 smartcard reader to work on Ubuntu 14.04

I am trying to work with an SEC1110 card reader on my Ubuntu lsusb provides this: Bus 003 Device 004: ID 0424:1104 Standard Microsystems Corp. I have installed the following: libusb pcsc-tools ...
2
votes
2answers
418 views

how to install <vlc/vlc.h>

In file included from channel.cpp:20:0: header.h:4:21: fatal error: vlc/vlc.h: No such file or directory #include <vlc/vlc.h> ^ compilation terminated. make: *** ...