0
votes
0answers
183 views

Error 255 when installing openSSL from source

I need to build openssl from source because it's needed to build a mysql driver for android for Qt but when I do "make install" I get the following error: cms.pod around line 457: Expected text after ...
-1
votes
1answer
736 views

How do I compile lbflow 1.1?

After using "sh ./configure" command, I encountered another error during lbflow package installation (a scientific one). The sequence of operations is here with error: ./configure --disable-gts ...
1
vote
2answers
84 views

How to compile 'stygmorgan-0.29'?

I am trying to compile stygmorgan-0.29.tar.bz2 and got these messages: stygmorganui.cxx:7:28: fatal error: stygmicon128.xpm: No such file or directory compilation terminated. make[2]: *** ...
1
vote
1answer
1k views

Installing PCRE from source…make install error!

I was trying to install pcre as it was needed by swig which is needed for installing gem5, anyway I am receiving this error after successful ./configure and make (however it's interesting that ...
0
votes
1answer
307 views

How to build libHaru and the examples which are included

I downloaded libHaru from http://libharu.org/. libHaru is a opensource pdf creator. Now in the INSTALL file says I only have to run ./configure && make && make install. When I run this ...
0
votes
1answer
754 views

Error installing ath9k Wireless Driver for Ubuntu 12.10

I'm following the instructions of this external link. When I enter sudo make install }}} I get the following error: make -C /lib/modules/3.5.0-17-generic/build ...
1
vote
1answer
601 views

Help with error: ‘struct sockaddr_storage’ has no member named ‘s_addr’ [closed]

I just installed Ubuntu 12.10 on my new machine, and I'm trying to install Ushare from the source from the website. I would just install it through the terminal using 'sudo apt-get install ushare' but ...
1
vote
1answer
1k views

Building LMMS: “Configuring incomplete, errors occurred!”

I tried to build Linux MultiMedia studio from the source of the SourceForge git:// repository under Ubuntu 12.04 LTS 32b: git clone git://lmms.git.sourceforge.net/gitroot/lmms/lmms cd lmms git ...
1
vote
1answer
57 views

installing program file

I am trying to install openssn on Ubuntu 12.04. I have extracted the file, and when I type cd openssn then sudo make in a terminal I get this: main.cpp:32:17: fatal error: SDL.h: No such file or ...
3
votes
1answer
132 views

Docbook errors building Komparator from source

I'm trying to install Komparator4 v0.8 from the terminal of Ubuntu 11.10. I entered this command and work fine: mkdir build && cd build && cmake -DCMAKE_INSTALL_PREFIX=`kde4-config ...
1
vote
1answer
473 views

'make: *** [TLS.o] Error 1' while installing nzbget

I'm trying to install nzbget on ubuntu 11.10. Here's the output of ./configure checking for a BSD-compatible install... /usr/bin/install -c checking whether build environment is sane... yes checking ...