The tag has no wiki summary.

learn more… | top users | synonyms

0
votes
1answer
30 views

“error while loading shared libraries” when running executable file

I tried to execute a file and I got an error: ./Tracking: error while loading shared libraries: libboost_system.so.1.49.0: cannot open shared object file: No such file or directory
1
vote
0answers
17 views

ubuntu 14.04 serious errors were found while checking the disk drive for / [on hold]

I install the Ubuntu inside the windows 7 when installation complete when computer reboot and I select ubuntu then the ubuntu are not open and say this error 'ubuntu 14.04 serious errors were found ...
0
votes
0answers
46 views

/usr/bin/ld: cannot find entry symbol _start; not setting start adress

My MakeFile is being executed with following options/flags: g++ -nostartfiles -g,-Wl,-O1 -Wl,-rpath,/opt/Qt5.4.0/5.4/gcc_64 -Wl,-rpath,/opt/Qt5.4.0/5.4/gcc_64/lib -o qml-material ...
0
votes
0answers
26 views

Frequent, seemingly unrelated, system errors in Ubuntu 15.04

I just installed 15.04 this evening and I've been system errors very frequently: sometimes as frequent as a few minutes apart. They never seem to be related. Sometimes it's with compiz, sometimes with ...
2
votes
0answers
80 views

Ubuntu15.04 installation xboxdrv error witch xboxdrv.service

Hello repeatedly I tried to install on Ubuntu 15.04 64 bit drivers for controller xbox360 and always got the same error after performing the following commands: sudo apt-add-repository ppa s: Rael-gc ...
-1
votes
1answer
33 views

err: unable to locate package package:i386 [duplicate]

When i install 32-bit libraries through command sudo apt-get install 32-bit libraries.Error occurred unable to locate package. Please give me solution of this error.
0
votes
1answer
9 views

Drupal Runtime error.. 14.04

I installed cURL on my server but this is still happening..? The Drupal installation went beautifully (no errors), and then whenever I try to click on a configuration link in the admin panel it goes ...
0
votes
1answer
39 views

Installing 14.04.2 on eeepc 1015PE

Good morning, I am having trouble installing Trusty Tahr on my netbook. I am attempting to achieve a dual boot configuration, my netbook came with windows 7 starter and so I am attempting to follow ...
0
votes
0answers
42 views

The update information is outdated (notification icon) ubuntu 14.10

hi i have some problems whit this ... i tried to manual update and still stays there... i went to software & updates and tried to check the problem there and i get this W:Failed to fetch http: ...
0
votes
1answer
30 views

broken dependencies are not solved

When i installed the sudo apt-get install dhcp3-server tftpd-hpa syslinux nfs-kernel-server initramfs-tools I got error. after that i wanted to fix the broken dependencies problem i tried ...
0
votes
0answers
9 views

SciDAVis 0.2.4-4 removes fitted functions upon re-opening a saved project

SciDAVis works fine when I make a new project. I enter data, plot it, and fit a relevant function to the graph. Then I save the project and close it. Upon re-opening the project I get an "Input ...
0
votes
0answers
6 views

ERROR:No Configuration directive found? [duplicate]

SYSLINUX 4.06 EDD 2012-10-23(C) 1994-2012 H. Peter An in et al How can I solve this error ....???? Even I boot it shows no default or UI configuration directive found
1
vote
1answer
37 views

tftpd-hpa installation failed in ubuntu software center

the full error is here. $sudo apt-get install tftpd-hpa [sudo] password for ashokkrishna: Reading package lists... Done Building dependency tree Reading state information... Done ...
1
vote
1answer
33 views

Problems installing rEFInd through windows after Ubuntu install

I installed Ubuntu alongside Windows and I can't figure out how to boot into Ubuntu. So now I'm trying to install rEFInd. Fallowing the instructions here I ran into a problem running the xcopy /E ...
0
votes
1answer
44 views

Not able to make successfully - undefined reference to symbol 'XCreateBitmapFromData'

/usr/bin/ld: ../bin/libanttweakbar.a(TwMgr.cpp.o): undefined reference to symbol 'XCreateBitmapFromData' /usr/lib/gcc/x86_64-linux-gnu/4.8/../../../x86_64-linux-gnu/libX11.so: error adding symbols: ...
1
vote
1answer
198 views

“mce: [Hardware Error]: Machine check events logged” appears in syslog. What should I do?

I have installed the latest version of OSSEC (2.8.1) and I have also enabled email notifications. And I am getting loads of these sorts of notifications saying that there is a Hardware Error and ...
0
votes
0answers
30 views

Bootloader problem upon installing Ubuntu - 0xc000007b

I'm having trouble installing Ubuntu. After running the installer, when it asks to reboot I restart and I get the following message from the Windows 8 bootloader: Status: 0xc000007b ...
0
votes
1answer
56 views

VPN Not working, PPtP

today I was trying to set up a VPN. I have all the credentials and everything entered, but every time I try to connect, it says this. Here are the pictures for the steps I take to recreate this ...
0
votes
1answer
58 views

PlayOnLinux via Steam fails badly! (3 of 3 failed)

Okay the following games did not work via steam but Steam worked... *DayZ (black box in corner then goes away!) *R.U.S.E. (stuck on loading screen!) *Unreal Tournament 3: Black Edition (logo apears ...
0
votes
0answers
86 views

Receiving “ERROR_GEN_FAILURE [0x0000001f]”

I am experimenting with Ubuntu to make it a Citrix box before learning more operating systems. My last step for the most part is learning how to add the Ubuntu 14.04 LTS machine to our Windows ...
0
votes
1answer
142 views

Error while unzipping: need PK compat. v5.1 (can do v4.6)

I am getting this error while unzipping a file how unzip it c0mrad3@dinp:~/output/zip$ unzip 00000018.zip Archive: 00000018.zip skipping: secret.txt need PK compat. v5.1 (can do ...
0
votes
2answers
54 views

dpkg: error processing package w3c-markup-validator

I have installed w3c-markup-validator on Ubuntu 14.04 with this command: sudo apt-get install w3c-markup-validator After that, each time I run apt-get update, apt-get upgrade or apt-get install I ...
-1
votes
1answer
30 views

games in ubutu are not running even with wine

i have installed wine. and direct x 9 redistributable as said in dedoimedo. But even now am not able to open COD4 modern warfare. It shows direct x error. How can i open games i Ubuntu? Suggest any ...
0
votes
1answer
32 views

GnuPG 2.0.27 Make Failure

Does anyone know what this means at the end of a GnuPG 'make" command: mv -f .deps/libcommon_a-signal.Tpo .deps/libcommon_a-signal.Po gcc -DHAVE_CONFIG_H -I. -I.. -I../gl -I../intl ...
0
votes
1answer
34 views

A folder cannot be deleted

Recently my windows 8 crashed so from the ubuntu I had to remove all the filesystem files which were in Windows C partition. But I am not able to delete one folder, Program Files (x86). I am using ...
0
votes
0answers
17 views

Post Boot Kernel Panics

I've been having an issue as of late. It happens when I try to play Dota 2. I get into a match, and sometimes my computer will crash randomly leaving this error: Keep in mind these crashes are ...
1
vote
1answer
141 views

How to fix Ubuntu 14.04 update problem?

I am trying to update my Ubuntu 14.04 (64 bit) and the software updater shows this error: Check if you are using third party repositories. If so disable them, since they are a common source of ...
0
votes
0answers
27 views

After installing game I get 80070507

I have recently tried to install resident evil 5 into play on linux. I installed directX as additional software, evrything installed normal, I have launcher, but, when I open it and press on ...
0
votes
0answers
60 views

Same error message at end of every update run

Each and every time that I run update, the last 4 lines read as follows: Reading package lists... Error! E: Encountered a section with no Package: header E: Problem with MergeList ...
4
votes
2answers
895 views

Unknown error: '<class 'KeyError'>' (“The cache has no package named wine-staging-i386”)

There is an error sign on my Ubuntu panel which states the error given in the title. I used sudo apt-get update but it gave me no errors. However the error sign persists. How do I fix this?
0
votes
0answers
26 views

ubuntu 14.04 hang after start loop service

after I try to start my service (I make a service that I stored in init.d) it seems the service loop that make my ubuntu hangs, well, I try to ctrl+alt+del e i s u b n, but my display still frezze. ...
0
votes
1answer
60 views

Start Up error messages?

When I boot my PC on I get the following errors before the login screen. [ 20.371238] Support for cores revisions 0x17 and 0x18 disabled by module param allhwsupport=0. Try b43.allhwsupport=1 [ ...
0
votes
0answers
35 views

Pipelight causing internal errors! Urgent!

This problem has been persisting for a while. I tried to install Wine and Pipelight to play Netflix on my computer. Big mistake! Something happened, and when I tried to remove the thing it isn't ...
0
votes
1answer
56 views

ubuntu MD5SUM hash doesnt match, now how to repair the iso image?

I have checked MD5SUM hash for the downloaded Ubuntu desktop 14.04 and it didn't match. I have downloaded the file from official website without using any client like utorrent etc. How can I repair ...
1
vote
0answers
199 views

Try to install Autodesk Maya on ubuntu 14.10

I try to install Autodesk Maya on ubuntu 14.10 through this video https://www.youtube.com/watch?v=pXw7aPRASEk , and open the first time and after close and open again, shows this message // Error: ...
0
votes
1answer
156 views

Error using shred

I have an 8GB SSD that had Windows 8.1. I was using a text editor and it locked up on me. I tried to format add a new partition and nothing happen. So I'm using Ubuntu on a external SD. I can read the ...
1
vote
1answer
142 views

firefox not working after trying to dowload firefox 34.0.5

I use the VMware Workstation to use Ubuntu on Windows. The current version of Firefox was 31.0 and the Mozilla Firefox download download page said that this was the current version! (34.0.5 is the ...
2
votes
1answer
69 views

Ubuntu 13.10 : error mounting /export/video1 on boot [closed]

Ubuntu 13.10 installed on Acer C720 Chromebook (after unscrewing write-protect screw and enabling SeaBIOS boot). Everything works OK except on boot, I get this message on the Ubuntu splash screen: ...
2
votes
1answer
43 views

Is there a link that I can use to link fitbit to pc

I want to link a fitbit to my PC but I cannot down load the software off the fitbit website as its says its not compaptable with Ubuntu
-1
votes
1answer
36 views

How do I get clean boot after fresh side by side install? [duplicate]

I was running Windows 7 Pro (32 bit) OS on my Dell Dimension 9100. I attempted to load (side by side) Ubuntu 14.04.1 desktop. The install appeared to work properly into a 19 GB partition. When ...
0
votes
0answers
37 views

Why do I get an winhttp.dll error everytime I start a search as a Z39.50 client using MarcEdit even if this file is not referenced in MarcEdit?

I use "MarcEdit 6" and there the tool "Z39.50/SRU Client". After starting the Z39.50 client I type in a search term an click the search button. Right then it gets to an error and I get the message: ...
0
votes
1answer
133 views

Cannot delete a folder

I have Segate backup + 1TB external HDD recently since 1 month i am unable to copy the files effectively sometimes the copying is 10 kb/s like that. and sometimes iam getting error like Input/output ...
1
vote
1answer
599 views

Sanddisk drive write protected

My sanddisk usb write protected i tried ashokkrishna@ashokkrishna-Lenovo-B560:~$ sudo mount -o rw /dev/sdc1 /mnt mount: block device /dev/sdc1 is write-protected, mounting read-only # sudo mkfs -t ...
0
votes
0answers
81 views

How to get rid of this exception

The stream or file "/home/nick/projects/Symfony/app/logs/dev.log" could not be opened: failed to open stream: Permission denied I get it in symfony. I know that I can go to app/logs and delete ...
0
votes
0answers
50 views

error: installing eclipse from software centre. please help

I`m getting this error while installing eclipse from software center. please help.... Error details are as follows: The following packages have unmet dependencies: eclipse-platform: ...
1
vote
0answers
174 views

Errors when trying to compile Android

Here's my error, any help would be greatly appreciated: libcore/luni/src/main/native/Register.cpp:36: error: undefined reference to 'register_android_system_OsConstants(_JNIEnv*)' clang: error: ...
0
votes
0answers
594 views

Support for cores revisions 0x17 and 0x18 disabled by module param allhwsupport=0

I was wondering if there is a fix for this problem, as every time I boot my laptop this message comes up. Is there any way to get rid if it? Thanks.
0
votes
0answers
134 views

“Too many full retries, give up” Error. How can I fix this?

I just installed Ubuntu 14.04. GRUB is not fully showing up and I reinstalled it as well as upgraded the Kernel and that didn't change anything. It gives me an error: "ERROR too many full retries, ...
-1
votes
1answer
270 views

Resolve error while installation!

i am getting the following error while installing anyhthing: installArchives() failed: perl: warning: Setting locale failed. perl: warning: Please check that your locale settings: LANGUAGE = ...
0
votes
1answer
16 views

I got an error while installing Ubuntu using windows installer

I got this error, please help: An error has occurred setting the element data. The request is not supported.