Questions related to compiling software, normally using the "make" command.

learn more… | top users | synonyms (2)

1
vote
1answer
236 views

Using repos vs compile: hot wo replace Nginx from repo with a compiled Nginx? [duplicate]

Sometime ago I used Kura's PPA to install Nginx+Pagespeed on my VPS. I would like to update it to the newest version, but the latest packages from Kura aren't so recent and I'm thinking about ...
0
votes
1answer
107 views

Whats the build version is used in the Bq release of Ubuntu touch?

I just wanted to know the exact build version being used in the Bq release of the Ubuntu touch phone. Is this Ubuntu-rtm 14.09 ? I see some parts are missing in my current ubuntu-touch. May be ...
2
votes
1answer
8k views

/bin/bash: g++: command not found error 127

I was trying to install a software quicknet from a tar.gz file. After using ./configure when i tried using make it showed the following erroe g++ -I. -I. -c QN_args.cc /bin/bash: g++: command not ...
0
votes
4answers
183 views

Is is possible to install Ubuntu on a computer with no OS

I'm building a gaming pc. I would like to install Ubuntu as my first OS. But I'm wondering is is possible to install it without having a OS installed, and how would I do this.
0
votes
1answer
104 views

Error running .exe compiled with i586-mingw32msvc-g++ and SFML

So well, I'm fighting with WINE and MinGW32 right now. So I have a file, sortem.cpp which is compiled with a Makefile and linked and all from that Makefile. sortem.cpp #include <windows.h> ...
1
vote
1answer
154 views

How can I get the default gcc compiler back?

I can't compile ("make") anything at the moment. It all ends with the following: as: unrecognized option '--64' So I searched for the cause and found that gcc -version gave me this: gcc (GCC) ...
0
votes
1answer
2k views

Problem linking against pcap.h

I am trying to compile ethping Here is the command that gets issued via make: gcc -Wall -Werror -ggdb -g -O2 -lpcap -o ethping ethping.o ieee8021ag.o dot1ag_eth.o I now get this error message: ...
1
vote
0answers
636 views

Undefined references to `_gfortran_runtime_error_at'

I use a model is written Fortran90 under Ubuntu 14.04. The gfortran 95 compiler (gfortran 4:4.8.2-1ubuntu6) and the gcc 4:4.8.2-1ubuntu6 is installed by Ubuntu Software Center. The installed gcc has ...
0
votes
1answer
394 views

Installing PyMOL from source code

I've tried running: prefix=/opt/pymol-svn modules=$prefix/modules python setup.py build install \ --home=$prefix \ --install-lib=$modules \ --install-scripts=$prefix with the following ...
1
vote
0answers
145 views

Rebuild OpenSSL with -DPURIFY

I'm trying to rebuild OpenSSL according to these instructions. I'm having a problem with the very first line: sudo apt-get build-dep libssl-dev This response is given: Reading package lists... ...
1
vote
1answer
6k views

glib.h make error. fatal error: glib.h: No such file or directory

for solution i searched on the Internet. i added the output of the command pkg-config --cflags glib-2.0 that is -I/usr/include/glib-2.0 -I/usr/lib/i386-linux-gnu/glib-2.0/include to the make file like ...
1
vote
2answers
104 views

Backup of Flashdrive

I am compiling some packages onto an external USB flash drive. Unfortunately, the compiling has not been going 100% and I often have to try redoing packages with different settings. To make sure that ...
2
votes
1answer
129 views

Compiling CARMEN Nav toolkit on Ubuntu 10.04

I'm a beginner to Ubuntu and I've been trying to install some robotics toolkits to be used on a Powerbot that I'm working on. I'm currently trying to install CARMEN Navigation toolkit and I have been ...
2
votes
0answers
2k views

AttributeError: 'module' object has no attribute python

I am struggling with compiling python 2.7.9 from source and have been advised to ask this question here. While installing python 2.7.9 following the steps described here the following errors ...
1
vote
1answer
129 views

How to build a program in Launchpad which has dependencies from external repository?

I am trying to build my program in Launchpad. Problem is, it depends on webkit2gtk (>= 2.6.2) and it isn't on my repository (because I don't maintain it), and it isn't on Ubuntu repositories either, ...
1
vote
0answers
1k views

undefined reference to symbol '__cxa_pure_virtual@@CXXABI_1.3'

I'm faced with the following error when I run make for the files from https://github.com/liuliu/ccv /usr/bin/ld: ../lib/liblinear.a(linear-static.o): undefined reference to symbol ...
1
vote
0answers
89 views

Ffmpeg 2.5.2 executable not replacing existing version

I'm trying to upgrade my ffmpeg from 0.10 to the latest (2.5.2). I performed the upgrade yesterday on a different Ubuntu 13.10 machine and it worked perfectly, so I'm not sure what I'm doing wrong. I ...
0
votes
1answer
196 views

can't build OpenGL software on 14.10 with fglrx-updates: “/usr/bin/ld: cannot find -lGL”

I'm running Ubuntu GNOME 14.10 on a new laptop with an "AMD A6-6310 APU with AMD Radeon R4 Graphics" type CPU/GPU. Due to freezing issues with Gallium3D, I installed fglrx-updates. Now because I like ...
0
votes
2answers
56 views

Why did this .tar.gz fail to install?

When I did the configure, I got this output checking for a BSD-compatible install... /usr/bin/install -c checking whether build environment is sane... yes checking for gawk... gawk checking whether ...
2
votes
0answers
98 views

How to compile GitHub's Atom editor [duplicate]

I'm trying to install GitHub's Atom editor. I'm using Ubuntu (trusty 14.04 with LXDE) on my Chromebook (via Crouton). It has an ARM processor (not Intel or AMD) so I can't use the .deb because that's ...
0
votes
1answer
269 views

sqlite make test fails because of “tcl.h not found” or “undefined reference to Tcl_Free”

I have obtained the sqlite source code with: sudo apt-get install fossil mkdir sqlite cd sqlite fossil clone http://www.sqlite.org/cgi/src/doc/trunk a fossil open a rm a and compiled it with the ...
1
vote
1answer
7k views

Where is my Java compiler 1.8, in Eclipse?

I installed openjdk8 In Eclipse (v3.8.1) -> window -> preferences -> Java -> installed JREs, I added the related standard VM. In Eclipse -> Project -> Properties -> Java build path, I changed the JRE ...
1
vote
1answer
899 views

libimobiledevice work on ubuntu but not in raspberry

I recently installed libimobiledevice in ubuntu via sudo apt-get install libimobiledevice and it worked like a charm with ios 8.1.2 ... But when I compile and install the latest libimobiledevice in ...
5
votes
1answer
6k views

How to install node-sass/gulp-sass on Ubuntu 14.04+ or Linux Mint 17+?

I'm trying to switch from gulp-ruby-sass to node-sass which is based on libsass a C implementation faster than the classic Ruby version. So far I've install the node packages: Node package cd ...
0
votes
1answer
89 views

GnuCOBOL not generating dynamic link library ELF references

Now GnuCOBOL, the Ubuntu package is open-cobol. As of Ubuntu 14.04? the compiler fails to link in dynamic library references for dlopen to use at run-time. No trace of the library in ldd from gcc -l ...
1
vote
1answer
642 views

Building and using a lib without installing it? (e.g. libcurl)

I'd like to use libcurl (a lib that handles HTTP connections) by linking it statically to a program I am writing. I am new to building programs from their source, so I have no clue on how to do it ...
2
votes
1answer
179 views

compiling g++ programs

I have the gcc installed. I can compile C programs. But I cannot compile C++ programs. If I write g++ on comd line, it says program not installed. I tried sudo apt-get install g++ It gives me a very ...
0
votes
1answer
329 views

Ubuntu freezes in recursion g++

Im using Ubuntu 14.04 and gcc version 4.8.2. Sometimes when I run some C++ code which has some bugs, for example Runtime Error, it goes to a deep recursion (I suppose...) and all my computer freezes. ...
0
votes
1answer
263 views

I need help compiling evince from source package on Ubuntu 14.10

After obtaining build-dependencies and source code for Evince document viewer through sudo apt-get build-dep evince apt-get source evince on ubuntu 14.10, I run configure script and got the ...
0
votes
1answer
195 views

get objdump to display full hex of a 64 bit mov instruction

objdump won't show me the hex of a long 64 bit instruction. objdump -d myobj.o here is one of the lines: 3: 48 bb 2f 2f 62 69 6e movabs $0x68732f6e69622f2f,%rbx the instruction hex cuts off ...
0
votes
2answers
547 views

error bcap library not found

During compiling of reaver-wps in Ubuntu 14.04 virtual machine on windows 7 32-bit host I received the error error : bcap library not found. I already installed sqlite3 , libsqlite3-dev , libcap-dev, ...
2
votes
1answer
1k views

sa-compile compilation error

I have a problem with the latest update for sa-compile (package 3.4.0-1ubuntu2 ) on ubuntu 14.04. When I install the package, I get the following error: .sa-compile (3.4.0-1ubuntu2) wird eingerichtet ...
0
votes
1answer
486 views

Ubuntu 14.04 Error when compile PHP 5.6.3

I did everything right with the installation of all dependencies for Apache2 and PHP i think. First I installed a clean Ubuntu 14.04 with all actual updates. Then I installed with "apt-get build-dep ...
1
vote
1answer
59 views

What is the best practice to manual build software on Ubuntu?

apt is great, this is also why many people choose Debian-based systems; however, there're some times that we need to build some software manually. (For example, for a newer version). I create a ...
0
votes
1answer
334 views

Build Emacs: cannot find -lpng15

I'm trying to build Emacs 24.4 and this error occured: /usr/bin/ld: cannot find -lpng15 collect2: error: ld returned 1 exit status make[1]: *** [temacs] Error 1 make[1]: Leaving directory ...
0
votes
1answer
831 views

How to overcome this error while compiling RT2870 driver?

I bought a rather cheap wifi antenna and now have to install RT2870 driver on Ubuntu 14.04 64 bit. I downloaded driver file 2010_0709_RT2870_Linux_STA_v2.4.0.1 from its official web page and tried ...
1
vote
1answer
159 views

How to pause a process until memory requirements drop

I'm compiling source code in the terminal but 75% of the time the build will freeze my system and I have to hard reboot or wait for a LONG time until oom kills it. I'm positive it's a memory issue ...
0
votes
1answer
420 views

Compiling error

Hi I need to run some tests with a CP ABE toolkit I've found, I'm a total newbie of Linux, I've started using for a few days, so please bear with me. I've found this video tutorial that was quite ...
1
vote
1answer
541 views

compile workrave from source

How do I install workrave from source? I cloned the source from github: git clone https://github.com/rcaelers/workrave.git cd workrave there is an INSTALL file which sais, I should use ...
1
vote
1answer
567 views

Problem with installing and compiling PHP 5.4.0

I have a VPS server on OVH Cloud, Ubuntu 14.04.1 LTS with plesk 12 installed. The server has been set up with the newest version of PHP , but Plesk can manage two different version of PHP in the ...
0
votes
2answers
8k views

How to resolve the “/lib/modules/3.13.0-27-generic/build: No such file or directory” error message?

I'm following the instructions on this page so I can submit enough information about my machine to this bug report module. I'm stuck in running some of the following commands git clone ...
0
votes
2answers
829 views

grep to get compile error

I have created a simple c program and have left off a ';' on purpose to get an error. I want using the grep command to know whether the compilation was successful or not. I use: gcc test.c | grep ...
0
votes
1answer
443 views

“No such file or directory” when trying to build ecolab

Im trying to build ecolab.5.D19 but I get error message "No such file or directory" even if the directories and files exists, and im in the same folder as MAKEFILE. I use the following command, which ...
1
vote
0answers
384 views

Errors when trying to compile Android

Here's my error, any help would be greatly appreciated: libcore/luni/src/main/native/Register.cpp:36: error: undefined reference to 'register_android_system_OsConstants(_JNIEnv*)' clang: error: ...
1
vote
1answer
150 views

Custom compile sqlite as php so

In Compile sqlite with soundex feature I learned how to do a custom compile of sqlite. While this was a step towards my goal of using sqlite's soundex in a functional test, I find I'm not there yet. ...
1
vote
1answer
58 views

cant compile audio software

I tried to install an audio software (SO-KL5 synth). My distro is Ubuntu 14.04 LTS. When I try to compile the software, it says it cant find jack and ALSA header files. Where are these files? Edit ...
1
vote
1answer
968 views

How I should build the official Linux driver for Wireless PCI card D-Link DWA-525 v.A2 in Ubuntu 14.04?

I have a new PCI wifi card, D-Link DW-525. By now i'm having no problem, since it has running a free driver. Using the command sudo lspci -v it returns this: 01:05.0 Network controller: Ralink ...
0
votes
2answers
277 views

How to compile Blender on ubuntu 14.04?

I am just using ubuntu 14.04, and i want to compile blender with Cmake, Here is the Website:http://wiki.blender.org/index.php/Dev:Doc/Building_Blender/Linux/Ubuntu/CMake When i already in the Cmake ...
0
votes
1answer
296 views

gfortran compiling GILDAS fails with undefined references to libgio

I'm trying to compile the software package GILDAS (http://www.iram.fr/IRAMFR/GILDAS/) from source on 14.04, and am getting stuck on the make checks, with an error which seems to be an issue either ...
1
vote
1answer
314 views

Updating linux kernel

Is it possible to update the Linux kernel without installing a new version of the Linux distro? If I want to download the kernel from the Linux website and manually install by compiling it, how can it ...